BDBM514540 US11096924, DASH-inhibitors 5320::US11583516, Cmpd ID 5320
SMILES CC1(CCCCC1)[C@H](N)C(=O)N1Cc2ccc(F)cc2C1
InChI Key InChIKey=HTMJAHPTKGPGQR-OAHLLOKOSA-N
Data  21 IC50
  Tab Delimited (TSV)   2D SDfile   Computed 3D by Vconf -m prep SDfile
Find this compound or compounds like it in BindingDB:
Activity Spreadsheet -- Enzyme Inhibition Constant Data from BindingDB
Found 21 hits for monomerid = 514540
TargetDipeptidyl peptidase 8(Homo sapiens (Human))
Trustees of Tufts College
US Patent
LigandPNGBDBM514540(US11096924, DASH-inhibitors 5320 | US11583516, Cmp...)
Affinity DataIC50:  1.90E+3nM. Assay description: EnzymesRecombinant human DPPIV (R&D Systems, Cat. No. 1180-SE)Recombinant human DPP8 (Enzo Life Sciences, Cat. No. BML-SE527)Recombinant human DPP9 (...
Ligand InfoPC cidPC sid
In DepthDetails US Patent
TargetDipeptidyl peptidase 8/9(Homo sapiens (Human))
Trustees of Tufts College
US Patent
LigandPNGBDBM514540(US11096924, DASH-inhibitors 5320 | US11583516, Cmp...)
Affinity DataIC50:  280nM. Assay description: Materials: Enzymes Recombinant human DPPIV (R&D Systems, Cat. No. 1180-SE). Recombinant human DPP8 (Enzo Life Sciences, Cat. No. BML-SE527). Recombin...
Ligand InfoPC cidPC sid
In DepthDetails US Patent
TargetDipeptidyl peptidase 4(Homo sapiens (Human))
Trustees of Tufts College
US Patent
LigandPNGBDBM514540(US11096924, DASH-inhibitors 5320 | US11583516, Cmp...)
Affinity DataIC50:  2.07E+6nM. Assay description: EnzymesRecombinant human DPPIV (R&D Systems, Cat. No. 1180-SE)Recombinant human DPP8 (Enzo Life Sciences, Cat. No. BML-SE527)Recombinant human DPP9 (...
Ligand InfoPC cidPC sid
In DepthDetails US Patent
TargetDipeptidyl peptidase 2(Homo sapiens (Human))
Trustees of Tufts College
US Patent
LigandPNGBDBM514540(US11096924, DASH-inhibitors 5320 | US11583516, Cmp...)
Affinity DataIC50:  5.39E+7nM. Assay description: EnzymesRecombinant human DPPIV (R&D Systems, Cat. No. 1180-SE)Recombinant human DPP8 (Enzo Life Sciences, Cat. No. BML-SE527)Recombinant human DPP9 (...
Ligand InfoPC cidPC sid
In DepthDetails US Patent
TargetProlyl endopeptidase FAP(Homo sapiens (Human))
Trustees of Tufts College
US Patent
LigandPNGBDBM514540(US11096924, DASH-inhibitors 5320 | US11583516, Cmp...)
Affinity DataIC50: >1.00E+8nM. Assay description: EnzymesRecombinant human DPPIV (R&D Systems, Cat. No. 1180-SE)Recombinant human DPP8 (Enzo Life Sciences, Cat. No. BML-SE527)Recombinant human DPP9 (...
Ligand InfoPC cidPC sid
In DepthDetails US Patent
TargetHomeobox protein PKNOX1(Human)
Trustees of Tufts College
US Patent
LigandPNGBDBM514540(US11096924, DASH-inhibitors 5320 | US11583516, Cmp...)
Affinity DataIC50:  8.95E+7nM. Assay description: EnzymesRecombinant human DPPIV (R&D Systems, Cat. No. 1180-SE)Recombinant human DPP8 (Enzo Life Sciences, Cat. No. BML-SE527)Recombinant human DPP9 (...
Ligand InfoPC cidPC sid
In DepthDetails US Patent
TargetDipeptidyl peptidase 8/9(Homo sapiens (Human))
Trustees of Tufts College
US Patent
LigandPNGBDBM514540(US11096924, DASH-inhibitors 5320 | US11583516, Cmp...)
Affinity DataIC50:  2.80E+5nM. Assay description: EnzymesRecombinant human DPPIV (R&D Systems, Cat. No. 1180-SE)Recombinant human DPP8 (Enzo Life Sciences, Cat. No. BML-SE527)Recombinant human DPP9 (...
Ligand InfoPC cidPC sid
In DepthDetails US Patent
TargetDipeptidyl peptidase 8(Homo sapiens (Human))
Trustees of Tufts College
US Patent
LigandPNGBDBM514540(US11096924, DASH-inhibitors 5320 | US11583516, Cmp...)
Affinity DataIC50:  1.90nM. Assay description: This assay is described in Bachovchin et al. Nature Chemical Biology 10, 656-663 (2014). Briefly, purified enzymes are coupled to Luminex microsphere...
Ligand InfoPC cidPC sid
In DepthDetails US Patent
TargetDipeptidyl peptidase 9(Homo sapiens (Human))
Trustees of Tufts College
US Patent
LigandPNGBDBM514540(US11096924, DASH-inhibitors 5320 | US11583516, Cmp...)
Affinity DataIC50:  7.90nM. Assay description: This assay is described in Bachovchin et al. Nature Chemical Biology 10, 656-663 (2014). Briefly, purified enzymes are coupled to Luminex microsphere...
Ligand InfoPC cidPC sid
In DepthDetails US Patent
TargetDipeptidyl peptidase 4(Homo sapiens (Human))
Trustees of Tufts College
US Patent
LigandPNGBDBM514540(US11096924, DASH-inhibitors 5320 | US11583516, Cmp...)
Affinity DataIC50:  2.07E+3nM. Assay description: This assay is described in Bachovchin et al. Nature Chemical Biology 10, 656-663 (2014). Briefly, purified enzymes are coupled to Luminex microsphere...
Ligand InfoPC cidPC sid
In DepthDetails US Patent
TargetDipeptidyl peptidase 2(Homo sapiens (Human))
Trustees of Tufts College
US Patent
LigandPNGBDBM514540(US11096924, DASH-inhibitors 5320 | US11583516, Cmp...)
Affinity DataIC50:  5.39E+4nM. Assay description: This assay is described in Bachovchin et al. Nature Chemical Biology 10, 656-663 (2014). Briefly, purified enzymes are coupled to Luminex microsphere...
Ligand InfoPC cidPC sid
In DepthDetails US Patent
TargetProlyl endopeptidase FAP(Homo sapiens (Human))
Trustees of Tufts College
US Patent
LigandPNGBDBM514540(US11096924, DASH-inhibitors 5320 | US11583516, Cmp...)
Affinity DataIC50: >1.00E+5nM. Assay description: This assay is described in Bachovchin et al. Nature Chemical Biology 10, 656-663 (2014). Briefly, purified enzymes are coupled to Luminex microsphere...
Ligand InfoPC cidPC sid
In DepthDetails US Patent
TargetProlyl endopeptidase(Homo sapiens (Human))
Trustees of Tufts College
US Patent
LigandPNGBDBM514540(US11096924, DASH-inhibitors 5320 | US11583516, Cmp...)
Affinity DataIC50:  8.95E+4nM. Assay description: This assay is described in Bachovchin et al. Nature Chemical Biology 10, 656-663 (2014). Briefly, purified enzymes are coupled to Luminex microsphere...
Ligand InfoPC cidPC sid
In DepthDetails US Patent
TargetDipeptidyl peptidase 8/9(Homo sapiens (Human))
Trustees of Tufts College
US Patent
LigandPNGBDBM514540(US11096924, DASH-inhibitors 5320 | US11583516, Cmp...)
Affinity DataIC50:  280nM. Assay description: This assay is described in Bachovchin et al. Nature Chemical Biology 10, 656-663 (2014). Briefly, purified enzymes are coupled to Luminex microsphere...
Ligand InfoPC cidPC sid
In DepthDetails US Patent
TargetDipeptidyl peptidase 8(Homo sapiens (Human))
Trustees of Tufts College
US Patent
LigandPNGBDBM514540(US11096924, DASH-inhibitors 5320 | US11583516, Cmp...)
Affinity DataIC50:  1.90nM. Assay description: Materials: Enzymes Recombinant human DPPIV (R&D Systems, Cat. No. 1180-SE). Recombinant human DPP8 (Enzo Life Sciences, Cat. No. BML-SE527). Recombin...
Ligand InfoPC cidPC sid
In DepthDetails US Patent
TargetDipeptidyl peptidase 9(Homo sapiens (Human))
Trustees of Tufts College
US Patent
LigandPNGBDBM514540(US11096924, DASH-inhibitors 5320 | US11583516, Cmp...)
Affinity DataIC50:  7.90nM. Assay description: Materials: Enzymes Recombinant human DPPIV (R&D Systems, Cat. No. 1180-SE). Recombinant human DPP8 (Enzo Life Sciences, Cat. No. BML-SE527). Recombin...
Ligand InfoPC cidPC sid
In DepthDetails US Patent
TargetDipeptidyl peptidase 4(Homo sapiens (Human))
Trustees of Tufts College
US Patent
LigandPNGBDBM514540(US11096924, DASH-inhibitors 5320 | US11583516, Cmp...)
Affinity DataIC50:  2.07E+3nM. Assay description: Materials: Enzymes Recombinant human DPPIV (R&D Systems, Cat. No. 1180-SE). Recombinant human DPP8 (Enzo Life Sciences, Cat. No. BML-SE527). Recombin...
Ligand InfoPC cidPC sid
In DepthDetails US Patent
TargetDipeptidyl peptidase 2(Homo sapiens (Human))
Trustees of Tufts College
US Patent
LigandPNGBDBM514540(US11096924, DASH-inhibitors 5320 | US11583516, Cmp...)
Affinity DataIC50:  5.39E+4nM. Assay description: Materials: Enzymes Recombinant human DPPIV (R&D Systems, Cat. No. 1180-SE). Recombinant human DPP8 (Enzo Life Sciences, Cat. No. BML-SE527). Recombin...
Ligand InfoPC cidPC sid
In DepthDetails US Patent
TargetProlyl endopeptidase FAP(Homo sapiens (Human))
Trustees of Tufts College
US Patent
LigandPNGBDBM514540(US11096924, DASH-inhibitors 5320 | US11583516, Cmp...)
Affinity DataIC50: >1.00E+5nM. Assay description: Materials: Enzymes Recombinant human DPPIV (R&D Systems, Cat. No. 1180-SE). Recombinant human DPP8 (Enzo Life Sciences, Cat. No. BML-SE527). Recombin...
Ligand InfoPC cidPC sid
In DepthDetails US Patent
TargetPresequence protease, mitochondrial (PREP)(Homo sapiens (Human))
Trustees of Tufts College
US Patent
LigandPNGBDBM514540(US11096924, DASH-inhibitors 5320 | US11583516, Cmp...)
Affinity DataIC50:  8.95E+4nM. Assay description: Materials: Enzymes Recombinant human DPPIV (R&D Systems, Cat. No. 1180-SE). Recombinant human DPP8 (Enzo Life Sciences, Cat. No. BML-SE527). Recombin...
Ligand InfoPC cidPC sid
In DepthDetails US Patent
TargetDipeptidyl peptidase 9(Homo sapiens (Human))
Trustees of Tufts College
US Patent
LigandPNGBDBM514540(US11096924, DASH-inhibitors 5320 | US11583516, Cmp...)
Affinity DataIC50:  7.90E+3nM. Assay description: EnzymesRecombinant human DPPIV (R&D Systems, Cat. No. 1180-SE)Recombinant human DPP8 (Enzo Life Sciences, Cat. No. BML-SE527)Recombinant human DPP9 (...
Ligand InfoPC cidPC sid
In DepthDetails US Patent