BDBM514545 US11096924, DASH-inhibitors 5333::US11559537, Compound 5333
SMILES N[C@@H](C1CCCC1)C(=O)N1Cc2ccc(F)cc2C1
InChI Key InChIKey=XJDRFKRPJFQLBB-AWEZNQCLSA-N
Data  14 IC50
  Tab Delimited (TSV)   2D SDfile   Computed 3D by Vconf -m prep SDfile
Find this compound or compounds like it in BindingDB:
Activity Spreadsheet -- Enzyme Inhibition Constant Data from BindingDB
Found 14 hits for monomerid = 514545
TargetDipeptidyl peptidase 8(Homo sapiens (Human))
Trustees of Tufts College
US Patent
LigandPNGBDBM514545(US11096924, DASH-inhibitors 5333 | US11559537, Com...)
Affinity DataIC50:  6.80E+3nM. Assay description: EnzymesRecombinant human DPPIV (R&D Systems, Cat. No. 1180-SE)Recombinant human DPP8 (Enzo Life Sciences, Cat. No. BML-SE527)Recombinant human DPP9 (...
Ligand InfoPC cidPC sid
In DepthDetails US Patent
TargetDipeptidyl peptidase 9(Homo sapiens (Human))
Trustees of Tufts College
US Patent
LigandPNGBDBM514545(US11096924, DASH-inhibitors 5333 | US11559537, Com...)
Affinity DataIC50:  5.20E+3nM. Assay description: EnzymesRecombinant human DPPIV (R&D Systems, Cat. No. 1180-SE)Recombinant human DPP8 (Enzo Life Sciences, Cat. No. BML-SE527)Recombinant human DPP9 (...
Ligand InfoPC cidPC sid
In DepthDetails US Patent
TargetDipeptidyl peptidase 4(Homo sapiens (Human))
Trustees of Tufts College
US Patent
LigandPNGBDBM514545(US11096924, DASH-inhibitors 5333 | US11559537, Com...)
Affinity DataIC50:  4.43E+6nM. Assay description: EnzymesRecombinant human DPPIV (R&D Systems, Cat. No. 1180-SE)Recombinant human DPP8 (Enzo Life Sciences, Cat. No. BML-SE527)Recombinant human DPP9 (...
Ligand InfoPC cidPC sid
In DepthDetails US Patent
TargetDipeptidyl peptidase 2(Homo sapiens (Human))
Trustees of Tufts College
US Patent
LigandPNGBDBM514545(US11096924, DASH-inhibitors 5333 | US11559537, Com...)
Affinity DataIC50:  2.65E+7nM. Assay description: EnzymesRecombinant human DPPIV (R&D Systems, Cat. No. 1180-SE)Recombinant human DPP8 (Enzo Life Sciences, Cat. No. BML-SE527)Recombinant human DPP9 (...
Ligand InfoPC cidPC sid
In DepthDetails US Patent
TargetProlyl endopeptidase FAP(Homo sapiens (Human))
Trustees of Tufts College
US Patent
LigandPNGBDBM514545(US11096924, DASH-inhibitors 5333 | US11559537, Com...)
Affinity DataIC50: >1.00E+8nM. Assay description: EnzymesRecombinant human DPPIV (R&D Systems, Cat. No. 1180-SE)Recombinant human DPP8 (Enzo Life Sciences, Cat. No. BML-SE527)Recombinant human DPP9 (...
Ligand InfoPC cidPC sid
In DepthDetails US Patent
TargetHomeobox protein PKNOX1(Human)
Trustees of Tufts College
US Patent
LigandPNGBDBM514545(US11096924, DASH-inhibitors 5333 | US11559537, Com...)
Affinity DataIC50:  8.74E+7nM. Assay description: EnzymesRecombinant human DPPIV (R&D Systems, Cat. No. 1180-SE)Recombinant human DPP8 (Enzo Life Sciences, Cat. No. BML-SE527)Recombinant human DPP9 (...
Ligand InfoPC cidPC sid
In DepthDetails US Patent
TargetDipeptidyl peptidase 8/9(Homo sapiens (Human))
Trustees of Tufts College
US Patent
LigandPNGBDBM514545(US11096924, DASH-inhibitors 5333 | US11559537, Com...)
Affinity DataIC50:  200nM. Assay description: This assay is described in Bachovchin et al. Nature Chemical Biology 10, 656-663 (2014). Briefly, purified enzymes are coupled to Luminex microsphere...
Ligand InfoPC cidPC sid
In DepthDetails US Patent
TargetDipeptidyl peptidase 8(Homo sapiens (Human))
Trustees of Tufts College
US Patent
LigandPNGBDBM514545(US11096924, DASH-inhibitors 5333 | US11559537, Com...)
Affinity DataIC50:  6.80nM. Assay description: This assay is described in Bachovchin et al. Nature Chemical Biology 10, 656-663 (2014). Briefly, purified enzymes are coupled to Luminex microsphere...
Ligand InfoPC cidPC sid
In DepthDetails US Patent
TargetDipeptidyl peptidase 9(Homo sapiens (Human))
Trustees of Tufts College
US Patent
LigandPNGBDBM514545(US11096924, DASH-inhibitors 5333 | US11559537, Com...)
Affinity DataIC50:  5.20nM. Assay description: This assay is described in Bachovchin et al. Nature Chemical Biology 10, 656-663 (2014). Briefly, purified enzymes are coupled to Luminex microsphere...
Ligand InfoPC cidPC sid
In DepthDetails US Patent
TargetDipeptidyl peptidase 4(Homo sapiens (Human))
Trustees of Tufts College
US Patent
LigandPNGBDBM514545(US11096924, DASH-inhibitors 5333 | US11559537, Com...)
Affinity DataIC50:  4.43E+3nM. Assay description: This assay is described in Bachovchin et al. Nature Chemical Biology 10, 656-663 (2014). Briefly, purified enzymes are coupled to Luminex microsphere...
Ligand InfoPC cidPC sid
In DepthDetails US Patent
TargetDipeptidyl peptidase 2(Homo sapiens (Human))
Trustees of Tufts College
US Patent
LigandPNGBDBM514545(US11096924, DASH-inhibitors 5333 | US11559537, Com...)
Affinity DataIC50:  2.65E+4nM. Assay description: This assay is described in Bachovchin et al. Nature Chemical Biology 10, 656-663 (2014). Briefly, purified enzymes are coupled to Luminex microsphere...
Ligand InfoPC cidPC sid
In DepthDetails US Patent
TargetProlyl endopeptidase FAP(Homo sapiens (Human))
Trustees of Tufts College
US Patent
LigandPNGBDBM514545(US11096924, DASH-inhibitors 5333 | US11559537, Com...)
Affinity DataIC50: >1.00E+5nM. Assay description: This assay is described in Bachovchin et al. Nature Chemical Biology 10, 656-663 (2014). Briefly, purified enzymes are coupled to Luminex microsphere...
Ligand InfoPC cidPC sid
In DepthDetails US Patent
TargetProlyl endopeptidase(Homo sapiens (Human))
Trustees of Tufts College
US Patent
LigandPNGBDBM514545(US11096924, DASH-inhibitors 5333 | US11559537, Com...)
Affinity DataIC50:  8.74E+4nM. Assay description: This assay is described in Bachovchin et al. Nature Chemical Biology 10, 656-663 (2014). Briefly, purified enzymes are coupled to Luminex microsphere...
Ligand InfoPC cidPC sid
In DepthDetails US Patent
TargetDipeptidyl peptidase 8/9(Homo sapiens (Human))
Trustees of Tufts College
US Patent
LigandPNGBDBM514545(US11096924, DASH-inhibitors 5333 | US11559537, Com...)
Affinity DataIC50:  2.00E+5nM. Assay description: EnzymesRecombinant human DPPIV (R&D Systems, Cat. No. 1180-SE)Recombinant human DPP8 (Enzo Life Sciences, Cat. No. BML-SE527)Recombinant human DPP9 (...
Ligand InfoPC cidPC sid
In DepthDetails US Patent