BDBM521438 US11149037, Example 20
SMILES CC(=O)Nc1ccn(n1)C(=O)N1CCC2(CCCN2C(=O)c2ccc(Cl)c(c2)C2CC2)CC1
InChI Key InChIKey=QJRQGXKSUYEBRK-UHFFFAOYSA-N
Data  2 IC50
  Tab Delimited (TSV)   2D SDfile   Computed 3D by Vconf -m prep SDfile
Find this compound or compounds like it in BindingDB:
Activity Spreadsheet -- Enzyme Inhibition Constant Data from BindingDB
Found 2 hits for monomerid = 521438
TargetFatty-acid amide hydrolase 1(Homo sapiens (Human))
H. Lundbeck
US Patent
LigandPNGBDBM521438(US11149037, Example 20)
Affinity DataIC50:  5.50E+3nM. Assay description: Proteomes (mouse brain membrane fraction or cell lysates for mouse assays; human prefrontal cortex or PC3 cell membrane fractions for human assays) (...
Ligand InfoPC cidPC sid
In DepthDetails US Patent
TargetMonoglyceride lipase(Homo sapiens (Human))
H. Lundbeck
US Patent
LigandPNGBDBM521438(US11149037, Example 20)
Affinity DataIC50: <100nM. Assay description: Proteomes (mouse brain membrane fraction or cell lysates for mouse assays; human prefrontal cortex or PC3 cell membrane fractions for human assays) (...
Ligand InfoPC cidPC sid
In DepthDetails US Patent