BDBM521464 N-(1-((3S)-3- Methyl-4-(3- (tetrahydro- 1H-furo [3,4-c]pyrrol- 5(3H)-yl)-4- (trifluoromethyl) benzyl) piperazine- 1-carbonyl)- 1H-pyrazol-3-::US11149037, Example 179
SMILES C[C@H]1CN(CCN1Cc1ccc(c(c1)N1CC2COCC2C1)C(F)(F)F)C(=O)n1ccc(NS(C)(=O)=O)n1
InChI Key InChIKey=OEWRFCCVXZKVPF-IVMQYODDSA-N
Data  1 IC50
  Tab Delimited (TSV)   2D SDfile   Computed 3D by Vconf -m prep SDfile
Find this compound or compounds like it in BindingDB:
Activity Spreadsheet -- Enzyme Inhibition Constant Data from BindingDB
Found 1 hit for monomerid = 521464
TargetMonoglyceride lipase(Homo sapiens (Human))
H. Lundbeck
US Patent
LigandPNGBDBM521464(N-(1-((3S)-3- Methyl-4-(3- (tetrahydro- 1H-furo [3...)
Affinity DataIC50: <100nM. Assay description: Proteomes (mouse brain membrane fraction or cell lysates for mouse assays; human prefrontal cortex or PC3 cell membrane fractions for human assays) (...
Ligand InfoPC cidPC sid
In DepthDetails US Patent