BDBM52167 2-amino-4-[2-(4-fluorobenzyl)oxy-3-methoxy-phenyl]-7-(2-furyl)-5-keto-4,6,7,8-tetrahydrochromene-3-carbonitrile::2-amino-4-[2-[(4-fluorophenyl)methoxy]-3-methoxyphenyl]-7-(2-furanyl)-5-oxo-4,6,7,8-tetrahydro-1-benzopyran-3-carbonitrile::2-amino-4-[2-[(4-fluorophenyl)methoxy]-3-methoxyphenyl]-7-(furan-2-yl)-5-oxo-4,6,7,8-tetrahydrochromene-3-carbonitrile::2-amino-4-{2-[(4-fluorobenzyl)oxy]-3-methoxyphenyl}-7-(2-furyl)-5-oxo-5,6,7,8-tetrahydro-4H-chromene-3-carbonitrile::2-azanyl-4-[2-[(4-fluorophenyl)methoxy]-3-methoxy-phenyl]-7-(furan-2-yl)-5-oxidanylidene-4,6,7,8-tetrahydrochromene-3-carbonitrile::MLS000043818::SMR000021029::cid_3241719
SMILES COc1cccc(C2C(C#N)C(=N)OC3=C2C(=O)CC(C3)c2ccco2)c1OCc1ccc(F)cc1
InChI Key InChIKey=MEIMLQNHCDWQKB-UHFFFAOYSA-N
Data  1 IC50  2 EC50
  Tab Delimited (TSV)   2D SDfile   Computed 3D by Vconf -m prep SDfile
Find this compound or compounds like it in BindingDB:
Activity Spreadsheet -- Enzyme Inhibition Constant Data from BindingDB
Found 1 hit for monomerid = 52167
TargetGenome polyprotein(Hepatitis C virus)
The Scripps Research Institute Molecular Screening Center
Curated by PubChem BioAssay
LigandPNGBDBM52167(2-amino-4-[2-(4-fluorobenzyl)oxy-3-methoxy-phenyl]...)
Affinity DataIC50:  3.35E+4nM. Assay description: Source (MLPCN Center Name): The Scripps Research Institute Molecular Screening Center (SRIMSC) Center Affiliation: The Scripps Research Institute (TS...
In DepthDetails PCBioAssay