BDBM524169 US11166958, Example 2
SMILES CNC(=O)[C@@H]1CN(Cc2cnc(Oc3ccc(C)cc3F)cn2)CCO1
InChI Key InChIKey=LTPRQGCLGGENCK-INIZCTEOSA-N
Data  1 IC50
  Tab Delimited (TSV)   2D SDfile   Computed 3D by Vconf -m prep SDfile
Find this compound or compounds like it in BindingDB:
Activity Spreadsheet -- Enzyme Inhibition Constant Data from BindingDB
Found 1 hit for monomerid = 524169
TargetRetinoic acid receptor RXR-beta(Homo sapiens (Human))
Boehringer Ingelheim International
US Patent
LigandPNGBDBM524169(US11166958, Example 2)
Affinity DataIC50:  123nM. Assay description: At the assay day cells were washed 3× with assay buffer (as described above), 10 μL buffer remained in the wells after washing. 10 μL Ca ki...
Ligand InfoPC cidPC sid
In DepthDetails US Patent