BDBM529909 US11203594, Example 19
SMILES CC(=O)c1c(C)c2cnc(N[C@@H]3CCOC[C@H]3O)nc2n(C2CC(C)(C)C2)c1=O
InChI Key InChIKey=OCVMTGAKDLXKAY-HZPDHXFCSA-N
Data  2 KI
  Tab Delimited (TSV)   2D SDfile   Computed 3D by Vconf -m prep SDfile
Find this compound or compounds like it in BindingDB:
Activity Spreadsheet -- Enzyme Inhibition Constant Data from BindingDB
Found 2 hits for monomerid = 529909
TargetCyclin-dependent kinase 6/G1/S-specific cyclin-D3(Homo sapiens (Human))
Pfizer
US Patent
LigandPNGBDBM529909(US11203594, Example 19)
Affinity DataKi:  4.20nM. Assay description: CDK4/Cyclin D1 and CDK6/Cylcin D3: The Chelation-Enhanced Fluorescence (CHEF) monitors the phosphorylation state in real time where the level of fluo...
Ligand InfoPC cidPC sid
In DepthDetails US Patent
TargetCyclin-dependent kinase 4/G1/S-specific cyclin-D1(Homo sapiens (Human))
Pfizer
US Patent
LigandPNGBDBM529909(US11203594, Example 19)
Affinity DataKi:  4.5nM. Assay description: CDK4/Cyclin D1 and CDK6/Cylcin D3: The Chelation-Enhanced Fluorescence (CHEF) monitors the phosphorylation state in real time where the level of fluo...
Ligand InfoPC cidPC sid
In DepthDetails US Patent