BDBM530429 6-(5-Cyclopropylpyrazin-2-yl)-7-fluoro-4-isopropyl-2-(o-tolyl)isoquinolin-1(2H)- one.::WO2022070068, Example 1
SMILES CC(C)c1cn(-c2ccccc2C)c(=O)c2cc(F)c(cc12)-c1cnc(cn1)C1CC1
InChI Key InChIKey=BXMIIHLSLKAJDV-UHFFFAOYSA-N
Data  1 IC50
  Tab Delimited (TSV)   2D SDfile   Computed 3D by Vconf -m prep SDfile
Find this compound or compounds like it in BindingDB:
Activity Spreadsheet -- Enzyme Inhibition Constant Data from BindingDB
Found 1 hit for monomerid = 530429
TargetDihydroorotate dehydrogenase (quinone), mitochondrial(Homo sapiens (Human))
Janssen Biotech
WIPO
LigandPNGBDBM530429(6-(5-Cyclopropylpyrazin-2-yl)-7-fluoro-4-isopropyl...)
Affinity DataIC50:  2.60nM. Assay description:  To detect DHODH enzyme activities, dichloroindophenol (DCIP) is added as the final electron acceptor in the assay. DCIP can accept electrons from th...
Ligand InfoPC cidPC sid
In DepthDetails PubMed