BDBM530447 2-(2-Chloro-4-methylpyridin-3-yl)-7-fluoro-6-(5-(2-hydroxypropan-2-yl)-1-methyl- 1H-1,2,4-triazol-3-yl)-4-isopropylisoquinolin-1(2H)-one.::WO2022070068, Example 19
SMILES CC(C)c1cn(-c2c(C)ccnc2Cl)c(=O)c2cc(F)c(cc12)-c1nc(n(C)n1)C(C)(C)O
InChI Key InChIKey=BQFZJBPIRPPJLR-UHFFFAOYSA-N
Data  1 IC50
  Tab Delimited (TSV)   2D SDfile   Computed 3D by Vconf -m prep SDfile
Find this compound or compounds like it in BindingDB:
Activity Spreadsheet -- Enzyme Inhibition Constant Data from BindingDB
Found 1 hit for monomerid = 530447
TargetDihydroorotate dehydrogenase (quinone), mitochondrial(Homo sapiens (Human))
Janssen Biotech
WIPO
LigandPNGBDBM530447(2-(2-Chloro-4-methylpyridin-3-yl)-7-fluoro-6-(5-(2...)
Affinity DataIC50:  2.5nM. Assay description:  To detect DHODH enzyme activities, dichloroindophenol (DCIP) is added as the final electron acceptor in the assay. DCIP can accept electrons from th...
Ligand InfoPC cidPC sid
In DepthDetails PubMed