BDBM532954 US11214566, Compound (I-M7-2R,4S)
SMILES CC1(C)CCC(=CC1)c1nc(ccc1NC(=O)c1nc(c[nH]1)C#N)[C@H]1CC(C)(C)O[C@@](C)(CO)C1
InChI Key
Data  3 IC50
  Tab Delimited (TSV)   2D SDfile   Computed 3D by Vconf -m prep SDfile
Find this compound or compounds like it in BindingDB:
Activity Spreadsheet -- Enzyme Inhibition Constant Data from BindingDB
Found 3 hits for monomerid = 532954
TargetMacrophage colony-stimulating factor 1 receptor(Homo sapiens (Human))
Janssen Pharmaceutica
US Patent
LigandPNGBDBM532954(US11214566, Compound (I-M7-2R,4S))
Affinity DataIC50:  7.10nM. Assay description: In this assay, recombinant human, dog or rat c-fms catalyzed the phosphorylation of the FMS peptide substrate, SYEGNSYTFIDPTQ, with the phosphorylate...
Ligand InfoPC cidPC sid
In DepthDetails US Patent
TargetMacrophage colony-stimulating factor 1 receptor(Rattus norvegicus (Rat))
Janssen Pharmaceutica
US Patent
LigandPNGBDBM532954(US11214566, Compound (I-M7-2R,4S))
Affinity DataIC50:  9.60nM. Assay description: In this assay, recombinant human, dog or rat c-fms catalyzed the phosphorylation of the FMS peptide substrate, SYEGNSYTFIDPTQ, with the phosphorylate...
Ligand InfoPC cidPC sid
In DepthDetails US Patent
TargetReceptor protein-tyrosine kinase(Dog)
Janssen Pharmaceutica
US Patent
LigandPNGBDBM532954(US11214566, Compound (I-M7-2R,4S))
Affinity DataIC50:  8nM. Assay description: In this assay, recombinant human, dog or rat c-fms catalyzed the phosphorylation of the FMS peptide substrate, SYEGNSYTFIDPTQ, with the phosphorylate...
Ligand InfoPC cidPC sid
In DepthDetails US Patent