BDBM535881 US11242312, Example 2
SMILES COc1cccc(c1)C(=O)N[C@@H](C(C)C)C(=O)NC(Cc1ccccc1)C(=O)C(=O)NC1CC1
InChI Key InChIKey=OUORWZAAYUKHHB-KEKNWZKVSA-N
Data  1 IC50
  Tab Delimited (TSV)   2D SDfile   Computed 3D by Vconf -m prep SDfile
Find this compound or compounds like it in BindingDB:
Activity Spreadsheet -- Enzyme Inhibition Constant Data from BindingDB
Found 1 hit for monomerid = 535881
TargetCalpain-1 catalytic subunit(Homo sapiens (Human))
Landsteiner Genmed
US Patent
LigandPNGBDBM535881(US11242312, Example 2)
Affinity DataIC50:  2.20nM. Assay description: Activity of Calpain 1 was measured by using Calpain-Glo Protease kit from Promega. Assays were run in 384-well black plates with clear bottom. 5 _...
Ligand InfoPC cidPC sid
In DepthDetails US Patent