BDBM543469 US11279702, Compound A1
SMILES OC(=O)CSc1nc2cc(c(Cl)cc2[nH]1)-c1ccc(cc1)-c1ccccc1O
InChI Key InChIKey=PEBVCCGQJKEUJM-UHFFFAOYSA-N
Data  1 EC50
  Tab Delimited (TSV)   2D SDfile   Computed 3D by Vconf -m prep SDfile
Find this compound or compounds like it in BindingDB:
Activity Spreadsheet -- Enzyme Inhibition Constant Data from BindingDB
Found 1 hit for monomerid = 543469
Target5'-AMP-activated protein kinase catalytic subunit alpha-1(Homo sapiens (Human))
Kallyope
US Patent
LigandPNGBDBM543469(US11279702, Compound A1)
Affinity DataEC50:  200nM. Assay description: Compound effect on AMPK enzyme activation was determined in a cell-free format with a 12-point concentration curve. The ADP-Glo detection system was ...
Ligand InfoPC cidPC sid
In DepthDetails US Patent