BDBM544453 25::US11285226, Compound 18f
SMILES CN1CCN(CC1)c1ccc(cc1)C(=C(\CCCO)c1ccccc1)\c1ccc(C)cc1
InChI Key InChIKey=PZDWZAMMWRBRBP-ZIADKAODSA-N
Data  4 IC50
  Tab Delimited (TSV)   2D SDfile   Computed 3D by Vconf -m prep SDfile
Find this compound or compounds like it in BindingDB:
Activity Spreadsheet -- Enzyme Inhibition Constant Data from BindingDB
Found 4 hits for monomerid = 544453
TargetEstrogen-related receptor gamma(Homo sapiens (Human))
Daegu-Gyeongbuk Medical Innovation Foundation
US Patent
LigandPNGBDBM544453(25 | US11285226, Compound 18f)
Affinity DataIC50:  26nM. Assay description: In an ERR alpha binding assay, GST-bound ERR alpha LBD was used, and all experiments other than that was the same as the ERR gamma binding assay.In a...
Ligand InfoPC cidPC sid
In DepthDetails US Patent
TargetEstrogen receptor(Homo sapiens (Human))
Daegu-Gyeongbuk Medical Innovation Foundation
US Patent
LigandPNGBDBM544453(25 | US11285226, Compound 18f)
Affinity DataIC50: >1.00E+4nM. Assay description: In an ERR alpha binding assay, GST-bound ERR alpha LBD was used, and all experiments other than that was the same as the ERR gamma binding assay.In a...
Ligand InfoPC cidPC sid
In DepthDetails US Patent
TargetSteroid hormone receptor ERR2(Homo sapiens (Human))
Daegu-Gyeongbuk Medical Innovation Foundation
US Patent
LigandPNGBDBM544453(25 | US11285226, Compound 18f)
Affinity DataIC50:  1.02E+3nM. Assay description: In an ERR alpha binding assay, GST-bound ERR alpha LBD was used, and all experiments other than that was the same as the ERR gamma binding assay.In a...
Ligand InfoPC cidPC sid
In DepthDetails US Patent
TargetSteroid hormone receptor ERR1(Homo sapiens (Human))
Daegu-Gyeongbuk Medical Innovation Foundation
US Patent
LigandPNGBDBM544453(25 | US11285226, Compound 18f)
Affinity DataIC50: >1.00E+4nM. Assay description: In an ERR alpha binding assay, GST-bound ERR alpha LBD was used, and all experiments other than that was the same as the ERR gamma binding assay.In a...
Ligand InfoPC cidPC sid
In DepthDetails US Patent