BDBM54765 2-(4-Amino-3,5-dichloro-phenyl)-3-hydroxy-4-oxo-1,4-dihydro-quinoline-7-carboxylic acid amide::2-(4-amino-3,5-dichloro-phenyl)-3-hydroxy-4-keto-1H-quinoline-7-carboxamide::2-(4-amino-3,5-dichlorophenyl)-3-hydroxy-4-oxo-1H-quinoline-7-carboxamide::2-[4-azanyl-3,5-bis(chloranyl)phenyl]-3-oxidanyl-4-oxidanylidene-1H-quinoline-7-carboxamide::MLS000888985::SMR000673922::cid_24789413
SMILES NC(=O)c1ccc2c(O)c(O)c(nc2c1)-c1cc(Cl)c(N)c(Cl)c1
InChI Key InChIKey=ZBPPGJYOWRLDBX-UHFFFAOYSA-N
Data  2 IC50
  Tab Delimited (TSV)   2D SDfile   Computed 3D by Vconf -m prep SDfile
Find this compound or compounds like it in BindingDB:
Activity Spreadsheet -- Enzyme Inhibition Constant Data from BindingDB
Found 2 hits for monomerid = 54765
TargetVoltage-dependent N-type calcium channel subunit alpha-1B(Homo sapiens (Human))
Burnham Center For Chemical Genomics
Curated by PubChem BioAssay
LigandPNGBDBM54765(2-(4-Amino-3,5-dichloro-phenyl)-3-hydroxy-4-oxo-1,...)
Affinity DataIC50:  1.41E+4nM. Assay description: Data Source: Data Source: Sanford-Burnham Center for Chemical Genomics (SBCCG) Source Affiliation: Sanford-Burnham Medical Research Institute Network...
In DepthDetails PCBioAssay
TargetAmyloid-beta A4 precursor protein-binding family A member 1(Rattus norvegicus)
Burnham Center For Chemical Genomics
Curated by PubChem BioAssay
LigandPNGBDBM54765(2-(4-Amino-3,5-dichloro-phenyl)-3-hydroxy-4-oxo-1,...)
Affinity DataIC50:  2.89E+4nM. Assay description: Data Source: Sanford-Burnham Center for Chemical Genomics (SBCCG) Source Affiliation: Sanford-Burnham Medical Research Institute (SBMRI, San Diego, C...
In DepthDetails PCBioAssay