BDBM551011 2-Cyclobutyl-3-(1H-indazol-5-yl)-5-isopropyl-imidazo[4,5-b]pyridine;::US11312712, Example 119
SMILES CC(C)c1ccc2nc(C3CCC3)n(-c3ccc4[nH]ncc4c3)c2n1
InChI Key InChIKey=DCRATCAAGMALSR-UHFFFAOYSA-N
Data  1 IC50
  Tab Delimited (TSV)   2D SDfile   Computed 3D by Vconf -m prep SDfile
Find this compound or compounds like it in BindingDB:
Activity Spreadsheet -- Enzyme Inhibition Constant Data from BindingDB
Found 1 hit for monomerid = 551011
TargetVoltage-dependent calcium channel gamma-8 subunit(Homo sapiens (Human))
Janssen Pharmaceutica
US Patent
LigandPNGBDBM551011(2-Cyclobutyl-3-(1H-indazol-5-yl)-5-isopropyl-imida...)
Affinity DataIC50:  0.0320nM. Assay description: An in vitro assay was used to determine the potency of test compounds as inhibitors of the glutamate response of the channel formed by GluA1o-γ8...
Ligand InfoPC cidPC sid
In DepthDetails US Patent