BDBM551197 3-(7-Chloro-1H-indazol-5-yl)-2-ethyl-5-(trifluoromethyl)imidazo[4,5-b]pyridine;::US11312712, Example 314
SMILES CCc1nc2ccc(nc2n1-c1cc(Cl)c2[nH]ncc2c1)C(F)(F)F
InChI Key InChIKey=OZAQMQRKIMGRQW-UHFFFAOYSA-N
Data  1 IC50
  Tab Delimited (TSV)   2D SDfile   Computed 3D by Vconf -m prep SDfile
Find this compound or compounds like it in BindingDB:
Activity Spreadsheet -- Enzyme Inhibition Constant Data from BindingDB
Found 1 hit for monomerid = 551197
TargetVoltage-dependent calcium channel gamma-8 subunit(Homo sapiens (Human))
Janssen Pharmaceutica
US Patent
LigandPNGBDBM551197(3-(7-Chloro-1H-indazol-5-yl)-2-ethyl-5-(trifluorom...)
Affinity DataIC50:  0.0320nM. Assay description: An in vitro assay was used to determine the potency of test compounds as inhibitors of the glutamate response of the channel formed by GluA1o-γ8...
Ligand InfoPC cidPC sid
In DepthDetails US Patent