BDBM551249 5-[2-Isopropyl-6-(trifluoromethyl)pyrrolo[2,3-b]pyridin-1-yl]-7-methyl-indolin-2-::US11312712, Example 367
SMILES CC(C)c1cc2ccc(nc2n1-c1cc2CC(=O)Nc2c(C)c1)C(F)(F)F
InChI Key InChIKey=AUUMKGXVWBTUKS-UHFFFAOYSA-N
Data  1 IC50
  Tab Delimited (TSV)   2D SDfile   Computed 3D by Vconf -m prep SDfile
Find this compound or compounds like it in BindingDB:
Activity Spreadsheet -- Enzyme Inhibition Constant Data from BindingDB
Found 1 hit for monomerid = 551249
TargetVoltage-dependent calcium channel gamma-8 subunit(Homo sapiens (Human))
Janssen Pharmaceutica
US Patent
LigandPNGBDBM551249(5-[2-Isopropyl-6-(trifluoromethyl)pyrrolo[2,3-b]py...)
Affinity DataIC50:  0.0250nM. Assay description: An in vitro assay was used to determine the potency of test compounds as inhibitors of the glutamate response of the channel formed by GluA1o-γ8...
Ligand InfoPC cidPC sid
In DepthDetails US Patent