BDBM552149 (21R,Z)-16-hydroxy-6,10,13,21a-tetrahydro-7,8-(epiprop[1]en[1]yl[3]ylidene)-14,21-methanobenzo[6,7]thiepino[4,5-c]pyrido[1,2-f][1]oxa[5,6,9]triazacyclotridecine-15,17-dione (Compound 46A) ::US11312727, Compound 46D
SMILES Oc1c2C(=O)N3CN([C@@H]4c5ccccc5SCc5cccc(OC\C=C\C3)c45)n2ccc1=O
InChI Key InChIKey=JRMKAQMVVMSJCT-LFTXJPJQSA-N
Data  1 IC50  1 EC50
  Tab Delimited (TSV)   2D SDfile   Computed 3D by Vconf -m prep SDfile
Find this compound or compounds like it in BindingDB:
Activity Spreadsheet -- Enzyme Inhibition Constant Data from BindingDB
Found 2 hits for monomerid = 552149
TargetPolymerase basic protein 2(Influenza A virus (strain A/WS/1933 H1N1))
Janssen Biopharma
US Patent
LigandPNGBDBM552149((21R,Z)-16-hydroxy-6,10,13,21a-tetrahydro-7,8-(epi...)
Affinity DataIC50:  11nM. Assay description: EN PA FRET inhibition assay was performed using a 19 nucleotide synthetic oligoribonucleotide substrate: 5′-FAM-AUUUUGUUUUUAAUAUUUC-BHQ-3′...
Ligand InfoPC cidPC sid
In DepthDetails US Patent
TargetPolymerase basic protein 2(Influenza A virus (strain A/WS/1933 H1N1))
Janssen Biopharma
US Patent
LigandPNGBDBM552149((21R,Z)-16-hydroxy-6,10,13,21a-tetrahydro-7,8-(epi...)
Affinity DataEC50:  1nM. Assay description: Human lung carcinoma A549 cells (ATCC, Manassas, Va.) were plated at a density of 5×104 cells/mL (10×103 cells/well) in assay media (Ham's F12 me...
Ligand InfoPC cidPC sid
In DepthDetails US Patent