BDBM552391 US11312727, Compound 157A
SMILES CC(C)(C)[C@H]1\C=C\COc2cccc3CSc4ccccc4[C@@H](N4CN1C(=O)c1c(O)c(=O)ccn41)c23
InChI Key InChIKey=VNTSANRBUMXAGE-CGRLJRMJSA-N
Data  1 IC50  1 EC50
  Tab Delimited (TSV)   2D SDfile   Computed 3D by Vconf -m prep SDfile
Find this compound or compounds like it in BindingDB:
Activity Spreadsheet -- Enzyme Inhibition Constant Data from BindingDB
Found 2 hits for monomerid = 552391
TargetPolymerase basic protein 2(Influenza A virus (strain A/WS/1933 H1N1))
Janssen Biopharma
US Patent
LigandPNGBDBM552391(US11312727, Compound 157A)
Affinity DataIC50:  29nM. Assay description: EN PA FRET inhibition assay was performed using a 19 nucleotide synthetic oligoribonucleotide substrate: 5′-FAM-AUUUUGUUUUUAAUAUUUC-BHQ-3′...
Ligand InfoPC cidPC sid
In DepthDetails US Patent
TargetPolymerase basic protein 2(Influenza A virus (strain A/WS/1933 H1N1))
Janssen Biopharma
US Patent
LigandPNGBDBM552391(US11312727, Compound 157A)
Affinity DataEC50:  1.30nM. Assay description: Human lung carcinoma A549 cells (ATCC, Manassas, Va.) were plated at a density of 5×104 cells/mL (10×103 cells/well) in assay media (Ham's F12 me...
Ligand InfoPC cidPC sid
In DepthDetails US Patent