BDBM555057 US11339151, Example 33
SMILES CCN(CCN1CCC(CC1)c1noc2cc(F)ccc12)C(=O)C1CCCCC1O
InChI Key InChIKey=CJCHZXCLUYLXJM-UHFFFAOYSA-N
Data  3 KI  1 IC50
  Tab Delimited (TSV)   2D SDfile   Computed 3D by Vconf -m prep SDfile
Find this compound or compounds like it in BindingDB:
Activity Spreadsheet -- Enzyme Inhibition Constant Data from BindingDB
Found 4 hits for monomerid = 555057
Target5-hydroxytryptamine receptor 2A(Homo sapiens (Human))
Sumitomo Dainippon Pharma
US Patent
LigandPNGBDBM555057(US11339151, Example 33)
Affinity DataKi:  0.300nM. Assay description: Human 5-HT2A Receptor, Human 5-HT7 Receptor, and Human D2 Receptor: Binding affinity of the present compound for human 5-HT2A receptor, human 5-HT7 r...
Ligand InfoPC cidPC sid
In DepthDetails US Patent
Target5-hydroxytryptamine receptor 7(Homo sapiens (Human))
Sumitomo Dainippon Pharma
US Patent
LigandPNGBDBM555057(US11339151, Example 33)
Affinity DataKi:  1.60nM. Assay description: Human 5-HT2A Receptor, Human 5-HT7 Receptor, and Human D2 Receptor: Binding affinity of the present compound for human 5-HT2A receptor, human 5-HT7 r...
Ligand InfoPC cidPC sid
In DepthDetails US Patent
TargetD(2) dopamine receptor(Homo sapiens (Human))
Sumitomo Dainippon Pharma
US Patent
LigandPNGBDBM555057(US11339151, Example 33)
Affinity DataKi:  55nM. Assay description: Human 5-HT2A Receptor, Human 5-HT7 Receptor, and Human D2 Receptor: Binding affinity of the present compound for human 5-HT2A receptor, human 5-HT7 r...
Ligand InfoPC cidPC sid
In DepthDetails US Patent
TargetPotassium voltage-gated channel subfamily H member 2(Homo sapiens (Human))
Sumitomo Dainippon Pharma
US Patent
LigandPNGBDBM555057(US11339151, Example 33)
Affinity DataIC50:  2.20E+3nM. Assay description: Extracellular and intracellular fluids used in the measurement were prepared as follows.Extracellular fluid: 2 mmol/L CaCl2, 1 mmol/L MgCl2, 10 mmol/...
Ligand InfoPC cidPC sid
In DepthDetails US Patent