BDBM556308 US11345702, Table 1.26::US20230390274, Compound A-40
SMILES Clc1cccc(c1)-n1ccc2cc(cnc12)C(=O)N1CCCCC1
InChI Key InChIKey=XTDJENPCFQBBPD-UHFFFAOYSA-N
Data  2 IC50
  Tab Delimited (TSV)   2D SDfile   Computed 3D by Vconf -m prep SDfile
Find this compound or compounds like it in BindingDB:
Activity Spreadsheet -- Enzyme Inhibition Constant Data from BindingDB
Found 2 hits for monomerid = 556308
Target5-hydroxytryptamine receptor 7(Homo sapiens (Human))
Epirium Bio
US Patent
LigandPNGBDBM556308(US11345702, Table 1.26 | US20230390274, Compound A...)
Affinity DataIC50: <100nM. Assay description: The in vitro biochemical assay can be performed in white, 384 plates in total 20 μl reaction volume consisting of 10 nM of 15-PGDH/HPGD (R&D Sys...
Ligand InfoPC cidPC sid
In DepthDetails US Patent
Target15-hydroxyprostaglandin dehydrogenase [NAD(+)](Homo sapiens (Human))
Myoforte Therapeutics
US Patent
LigandPNGBDBM556308(US11345702, Table 1.26 | US20230390274, Compound A...)
Affinity DataIC50:  1.5nM. Assay description: A hydroxyprostaglandin dehydrogenase inhibition screening biochemical assay can be performed to assess the synthesized inhibitors provided herein. Pr...
Ligand InfoPC cidPC sid
In DepthDetails US Patent