BDBM558452 3-[[6-(4-Chloro-1H-pyrazol-5-yl)-3-pyridinyl]oxymethyl]-5-methylsulfonylphenol::US11365192, Example 66-1
SMILES CS(=O)(=O)c1cc(O)cc(COc2ccc(nc2)-c2[nH]ncc2Cl)c1
InChI Key InChIKey=CYJCMKSVIZOTHB-UHFFFAOYSA-N
Data  2 IC50
  Tab Delimited (TSV)   2D SDfile   Computed 3D by Vconf -m prep SDfile
Find this compound or compounds like it in BindingDB:
Activity Spreadsheet -- Enzyme Inhibition Constant Data from BindingDB
Found 2 hits for monomerid = 558452
TargetCytochrome P450 4A11(Homo sapiens)
Taisho Pharmaceutical
US Patent
LigandPNGBDBM558452(3-[[6-(4-Chloro-1H-pyrazol-5-yl)-3-pyridinyl]oxyme...)
Affinity DataIC50:  33nM. Assay description: In the CYP4F2 inhibition test, the reaction solution containing each compound [final concentration of 50 mM, KPO4 (pH 7.4), 2.5 μM luciferine de...
Ligand InfoPC cidPC sid
In DepthDetails US Patent
TargetCytochrome P450 4F2(Homo sapiens (Human))
Taisho Pharmaceutical
US Patent
LigandPNGBDBM558452(3-[[6-(4-Chloro-1H-pyrazol-5-yl)-3-pyridinyl]oxyme...)
Affinity DataIC50:  16nM. Assay description: In the CYP4F2 inhibition test, the reaction solution containing each compound [final concentration of 50 mM, KPO4 (pH 7.4), 2.5 μM luciferine de...
Ligand InfoPC cidPC sid
In DepthDetails US Patent