BDBM558743 Isomer 2 of 1-(3-(3,4-Dihydroisoquinolin-2(1H)-yl)-2-hydroxypropyl)-3-(4-::US11365205, Example 15b
SMILES Cc1ccc(CN2CCN(C[C@@H](O)CN3CCc4ccccc4C3)C2=O)cc1
InChI Key InChIKey=NUUFJYKOFMIQGN-QFIPXVFZSA-N
Data  1 IC50
  Tab Delimited (TSV)   2D SDfile   Computed 3D by Vconf -m prep SDfile
Find this compound or compounds like it in BindingDB:
Activity Spreadsheet -- Enzyme Inhibition Constant Data from BindingDB
Found 1 hit for monomerid = 558743
TargetMethylosome protein 50/Protein arginine N-methyltransferase 5(Homo sapiens (Human))
Aurigene Discovery Technologies
US Patent
LigandPNGBDBM558743(Isomer 2 of 1-(3-(3,4-Dihydroisoquinolin-2(1H)-yl)...)
Affinity DataIC50:  50nM. Assay description: Protein arginine methyltransferase 5 (PRMT5) is a type II arginine methyltransferase that catalyze mono- and symmetric demethylation on arginine resi...
Ligand InfoPC cidPC sid
In DepthDetails US Patent