BDBM558787 (R)-1-(3-(3,4-dihydroisoquinolin-2(1H)-yl)-2-hydroxypropyl)-3-((5-(piperidine-::US11365205, Example 54
SMILES O[C@@H](CN1CCN(Cc2ccc(cn2)C(=O)N2CCCCC2)C1=O)CN1CCc2ccccc2C1
InChI Key InChIKey=PNSSQUBIOFAMCO-RUZDIDTESA-N
Data  1 IC50
  Tab Delimited (TSV)   2D SDfile   Computed 3D by Vconf -m prep SDfile
Find this compound or compounds like it in BindingDB:
Activity Spreadsheet -- Enzyme Inhibition Constant Data from BindingDB
Found 1 hit for monomerid = 558787
TargetMethylosome protein 50/Protein arginine N-methyltransferase 5(Homo sapiens (Human))
Aurigene Discovery Technologies
US Patent
LigandPNGBDBM558787((R)-1-(3-(3,4-dihydroisoquinolin-2(1H)-yl)-2-hydro...)
Affinity DataIC50:  30nM. Assay description: Protein arginine methyltransferase 5 (PRMT5) is a type II arginine methyltransferase that catalyze mono- and symmetric demethylation on arginine resi...
Ligand InfoPC cidPC sid
In DepthDetails US Patent