BDBM558845 (R)-1-(3-(3,4-dihydroisoquinolin-2(1H)-yl)-2-hydroxypropyl)-3-((5-((tetrahydro-::US11365205, Example 109
SMILES CC(=O)N1CCC(CC1)Nc1ccc(CN2CCN(C[C@H](O)CN3CCc4ccccc4C3)C2=O)nc1
InChI Key InChIKey=ATGRJIJETUETJD-HHHXNRCGSA-N
Data  1 IC50
  Tab Delimited (TSV)   2D SDfile   Computed 3D by Vconf -m prep SDfile
Find this compound or compounds like it in BindingDB:
Activity Spreadsheet -- Enzyme Inhibition Constant Data from BindingDB
Found 1 hit for monomerid = 558845
TargetMethylosome protein 50/Protein arginine N-methyltransferase 5(Homo sapiens (Human))
Aurigene Discovery Technologies
US Patent
LigandPNGBDBM558845((R)-1-(3-(3,4-dihydroisoquinolin-2(1H)-yl)-2-hydro...)
Affinity DataIC50:  40nM. Assay description: Protein arginine methyltransferase 5 (PRMT5) is a type II arginine methyltransferase that catalyze mono- and symmetric demethylation on arginine resi...
Ligand InfoPC cidPC sid
In DepthDetails US Patent