BDBM567660 US11420968, Example F22
SMILES [O-][N+](=O)c1cc(ccc1NCC1(F)CCOCC1)S(=O)(=O)NC(=O)c1ccc(cc1Oc1cnc2[nH]ccc2c1)N1CCC2(CC(C2)N2CCC[C@H]2c2ccccc2C2CC2)CC1
InChI Key
Data  5 IC50
  Tab Delimited (TSV)   2D SDfile   Computed 3D by Vconf -m prep SDfile
Find this compound or compounds like it in BindingDB:
Activity Spreadsheet -- Enzyme Inhibition Constant Data from BindingDB
Found 5 hits for monomerid = 567660
TargetApoptosis regulator Bcl-2(Homo sapiens (Human))
Beigene
US Patent
LigandPNGBDBM567660(US11420968, Example F22)
Affinity DataIC50:  0.0320nM. Assay description: Compounds disclosed herein were tested for blocking of Bcl-2/Bcl-X protein with its ligand in an assay based on Time-Resolved Fluorescence Resonance ...
Ligand InfoPC cidPC sid
In DepthDetails US Patent
TargetBcl-2-like protein 1(Homo sapiens (Human))
Beigene
US Patent
LigandPNGBDBM567660(US11420968, Example F22)
Affinity DataIC50:  26nM. Assay description: Compounds disclosed herein were tested for blocking of Bcl-2/Bcl-X protein with its ligand in an assay based on Time-Resolved Fluorescence Resonance ...
Ligand InfoPC cidPC sid
In DepthDetails US Patent
TargetBcl-2-like protein 1(Homo sapiens (Human))
Beigene
US Patent
LigandPNGBDBM567660(US11420968, Example F22)
Affinity DataIC50:  26nM. Assay description: Compounds disclosed herein were tested for blocking of Bcl-2/Bcl-xl protein with its ligand in an assay based on fluorescence polarization methodolog...
Ligand InfoPC cidPC sid
In DepthDetails US Patent
TargetApoptosis regulator Bcl-2(Homo sapiens (Human))
Beigene
US Patent
LigandPNGBDBM567660(US11420968, Example F22)
Affinity DataIC50:  0.0320nM. Assay description: Compounds disclosed herein were tested for blocking of Bcl-2/Bcl-xl protein with its ligand in an assay based on fluorescence polarization methodolog...
Ligand InfoPC cidPC sid
In DepthDetails US Patent
TargetApoptosis regulator Bcl-2(Homo sapiens (Human))
Beigene
US Patent
LigandPNGBDBM567660(US11420968, Example F22)
Affinity DataIC50:  1.70nM. Assay description: Compounds disclosed herein were tested for blocking of Bcl-2/Bcl-xl protein with its ligand in an assay based on fluorescence polarization methodolog...
Ligand InfoPC cidPC sid
In DepthDetails US Patent