BDBM567773 US11420968, Example F132b
SMILES CC(C)c1ccccc1[C@H]1CN(C)CCN1C1CC2(C1)CCN(CC2)c1ccc(C(=O)NS(=O)(=O)c2ccc(NC[C@H]3CC[C@](C)(O)CC3)c(c2)[N+]([O-])=O)c(Oc2cnc3[nH]ccc3c2)c1
InChI Key
Data  5 IC50
  Tab Delimited (TSV)   2D SDfile   Computed 3D by Vconf -m prep SDfile
Find this compound or compounds like it in BindingDB:
Activity Spreadsheet -- Enzyme Inhibition Constant Data from BindingDB
Found 5 hits for monomerid = 567773
TargetApoptosis regulator Bcl-2(Homo sapiens (Human))
Beigene
US Patent
LigandPNGBDBM567773(US11420968, Example F132b)
Affinity DataIC50:  0.0150nM. Assay description: Compounds disclosed herein were tested for blocking of Bcl-2/Bcl-X protein with its ligand in an assay based on Time-Resolved Fluorescence Resonance ...
Ligand InfoPC cidPC sid
In DepthDetails US Patent
TargetBcl-2-like protein 1(Homo sapiens (Human))
Beigene
US Patent
LigandPNGBDBM567773(US11420968, Example F132b)
Affinity DataIC50:  7.10nM. Assay description: Compounds disclosed herein were tested for blocking of Bcl-2/Bcl-X protein with its ligand in an assay based on Time-Resolved Fluorescence Resonance ...
Ligand InfoPC cidPC sid
In DepthDetails US Patent
TargetBcl-2-like protein 1(Homo sapiens (Human))
Beigene
US Patent
LigandPNGBDBM567773(US11420968, Example F132b)
Affinity DataIC50:  7.10nM. Assay description: Compounds disclosed herein were tested for blocking of Bcl-2/Bcl-X protein with its ligand in an assay based on Time-Resolved Fluorescence Resonance ...
Ligand InfoPC cidPC sid
In DepthDetails US Patent
TargetApoptosis regulator Bcl-2(Homo sapiens (Human))
Beigene
US Patent
LigandPNGBDBM567773(US11420968, Example F132b)
Affinity DataIC50:  0.0150nM. Assay description: Compounds disclosed herein were tested for blocking of Bcl-2/Bcl-X protein with its ligand in an assay based on Time-Resolved Fluorescence Resonance ...
Ligand InfoPC cidPC sid
In DepthDetails US Patent
TargetApoptosis regulator Bcl-2(Homo sapiens (Human))
Beigene
US Patent
LigandPNGBDBM567773(US11420968, Example F132b)
Affinity DataIC50:  0.310nM. Assay description: Selected compounds disclosed herein were tested for blocking of Bcl-2-G101 protein with its ligand in an assay based on time-resolved fluorescence re...
Ligand InfoPC cidPC sid
In DepthDetails US Patent