BDBM567987 US11420970, Example 188
SMILES COc1ccc(cc1F)-c1cc(Cn2cnc3c(N)ncnc23)c(cn1)N1CCC[C@@](N)(C1)c1ccc(F)c(Cl)n1
InChI Key InChIKey=UPUOGLBNGLKLGX-MUUNZHRXSA-N
Data  1 IC50
  Tab Delimited (TSV)   2D SDfile   Computed 3D by Vconf -m prep SDfile
Find this compound or compounds like it in BindingDB:
Activity Spreadsheet -- Enzyme Inhibition Constant Data from BindingDB
Found 1 hit for monomerid = 567987
TargetHistone-lysine N-methyltransferase NSD2(Homo sapiens (Human))
Novartis
US Patent
LigandPNGBDBM567987(US11420970, Example 188)
Affinity DataIC50:  5.5nM. Assay description: This assay employed LC-MS/MS technology to monitor the SAH production from the NSD2 enzymatic reaction. The enzymatic reaction was performed in white...
Ligand InfoPC cidPC sid
In DepthDetails US Patent