BDBM567989 US11420970, Example 190
SMILES Cc1nc(ccc1F)[C@@]1(N)CCCN(C1)c1cnc(cc1Cn1cnc2c(N)ncnc12)-c1ccc(F)cc1
InChI Key InChIKey=JGIQVKOGKUGKGV-MUUNZHRXSA-N
Data  1 IC50
  Tab Delimited (TSV)   2D SDfile   Computed 3D by Vconf -m prep SDfile
Find this compound or compounds like it in BindingDB:
Activity Spreadsheet -- Enzyme Inhibition Constant Data from BindingDB
Found 1 hit for monomerid = 567989
TargetHistone-lysine N-methyltransferase NSD2(Homo sapiens (Human))
Novartis
US Patent
LigandPNGBDBM567989(US11420970, Example 190)
Affinity DataIC50:  5.5nM. Assay description: This assay employed LC-MS/MS technology to monitor the SAH production from the NSD2 enzymatic reaction. The enzymatic reaction was performed in white...
Ligand InfoPC cidPC sid
In DepthDetails US Patent