BDBM568036 US11420970, Example 238
SMILES Nc1ncnc2n(Cc3cc(ncc3N3CCC[C@@](N)(C3)c3cccc(Cl)n3)-c3ccc(F)cc3F)cnc12
InChI Key InChIKey=CWCFNQAKFWLGNB-HHHXNRCGSA-N
Data  1 IC50
  Tab Delimited (TSV)   2D SDfile   Computed 3D by Vconf -m prep SDfile
Find this compound or compounds like it in BindingDB:
Activity Spreadsheet -- Enzyme Inhibition Constant Data from BindingDB
Found 1 hit for monomerid = 568036
TargetHistone-lysine N-methyltransferase NSD2(Homo sapiens (Human))
Novartis
US Patent
LigandPNGBDBM568036(US11420970, Example 238)
Affinity DataIC50:  5.5nM. Assay description: This assay employed LC-MS/MS technology to monitor the SAH production from the NSD2 enzymatic reaction. The enzymatic reaction was performed in white...
Ligand InfoPC cidPC sid
In DepthDetails US Patent