BDBM571411 US11440922, Example 28::ethyl (4E)-4-{3-[3- (cyanomethyl)phenyl]prop- 2-yn-1-ylidene}-3,3- dimethylpiperidine-1- carboxylate
SMILES CCOC(=O)N1CC\C(=C/C#Cc2cccc(CC#N)c2)C(C)(C)C1
InChI Key InChIKey=MWXPVZFGTDVLJN-VXLYETTFSA-N
Data  1 KI  1 IC50
  Tab Delimited (TSV)   2D SDfile   Computed 3D by Vconf -m prep SDfile
Find this compound or compounds like it in BindingDB:
Activity Spreadsheet -- Enzyme Inhibition Constant Data from BindingDB
Found 2 hits for monomerid = 571411
TargetMetabotropic glutamate receptor 5(Homo sapiens (Human))
Recordati Industria Chimica E Farmacentica
US Patent
LigandPNGBDBM571411(US11440922, Example 28 | ethyl (4E)-4-{3-[3- (cyan...)
Affinity DataKi:  2.12nM. Assay description: Affinity at transmembrane glutamate metabotropic cloned human mGluR5 receptor was evaluated according to the methods of Anderson (Anderson et al., J ...
Ligand InfoPC cidPC sid
In DepthDetails US Patent
TargetMetabotropic glutamate receptor 5(Homo sapiens (Human))
Recordati Industria Chimica E Farmacentica
US Patent
LigandPNGBDBM571411(US11440922, Example 28 | ethyl (4E)-4-{3-[3- (cyan...)
Affinity DataIC50:  37.2nM. Assay description: Cells were seeded into black-walled, clear-bottom, 96-well plates at a density of 80000 cell/well, in RPMI (without Phenol Red, without L-glutamine; ...
Ligand InfoPC cidPC sid
In DepthDetails US Patent