BDBM577775 US11478460, Compound 1.115
SMILES Cc1cnc(N2CCc3nn(c(c3C2)-c2cc(F)c(NC(N)=O)cc2F)-c2c(C)cccc2C)c(Cl)c1
InChI Key InChIKey=IUBFMQUYWMOMAT-UHFFFAOYSA-N
Data  1 IC50
  Tab Delimited (TSV)   2D SDfile   Computed 3D by Vconf -m prep SDfile
Find this compound or compounds like it in BindingDB:
Activity Spreadsheet -- Enzyme Inhibition Constant Data from BindingDB
Found 1 hit for monomerid = 577775
TargetC5a anaphylatoxin chemotactic receptor 1(Homo sapiens (Human))
Chemocentryx
US Patent
LigandPNGBDBM577775(US11478460, Compound 1.115)
Affinity DataIC50: <5nM. Assay description: Optionally, compounds may be further assayed for their ability to inhibit chemotaxis in cells. Chemotaxis assays are performed using 5 μm pore p...
Ligand InfoPC cidPC sid
In DepthDetails US Patent