BDBM577797 US11478460, Compound 1.137
SMILES CC(C)COc1cccc(C)c1-n1nc2CCN(Cc2c1-c1cc(F)c(NC(N)=O)cc1F)c1ccnc(n1)C(F)(F)F
InChI Key InChIKey=ARKNZZGUEWVUBL-UHFFFAOYSA-N
Data  1 IC50
  Tab Delimited (TSV)   2D SDfile   Computed 3D by Vconf -m prep SDfile
Find this compound or compounds like it in BindingDB:
Activity Spreadsheet -- Enzyme Inhibition Constant Data from BindingDB
Found 1 hit for monomerid = 577797
TargetC5a anaphylatoxin chemotactic receptor 1(Homo sapiens (Human))
Chemocentryx
US Patent
LigandPNGBDBM577797(US11478460, Compound 1.137)
Affinity DataIC50: <5nM. Assay description: Optionally, compounds may be further assayed for their ability to inhibit chemotaxis in cells. Chemotaxis assays are performed using 5 μm pore p...
Ligand InfoPC cidPC sid
In DepthDetails US Patent