BDBM577977 US11478460, Compound 1.317
SMILES CC(C)COc1cccc(C)c1-n1nc2CCN(Cc2c1-c1ccc(NC(N)=O)cc1)c1ccc(Cl)cc1C(F)(F)F
InChI Key InChIKey=OETIZBYMUYYWTF-UHFFFAOYSA-N
Data  1 IC50
  Tab Delimited (TSV)   2D SDfile   Computed 3D by Vconf -m prep SDfile
Find this compound or compounds like it in BindingDB:
Activity Spreadsheet -- Enzyme Inhibition Constant Data from BindingDB
Found 1 hit for monomerid = 577977
TargetC5a anaphylatoxin chemotactic receptor 1(Homo sapiens (Human))
Chemocentryx
US Patent
LigandPNGBDBM577977(US11478460, Compound 1.317)
Affinity DataIC50: <5nM. Assay description: Optionally, compounds may be further assayed for their ability to inhibit chemotaxis in cells. Chemotaxis assays are performed using 5 μm pore p...
Ligand InfoPC cidPC sid
In DepthDetails US Patent