BDBM580663 US11492346, Example 3
SMILES COc1cccc(OC)c1S(=O)(=O)Nc1noc2cc(Cn3nccc3C)cc(OC)c12
InChI Key InChIKey=GEQMWJGTEXMGPS-UHFFFAOYSA-N
Data  6 KI
  Tab Delimited (TSV)   2D SDfile   Computed 3D by Vconf -m prep SDfile
Find this compound or compounds like it in BindingDB:
Activity Spreadsheet -- Enzyme Inhibition Constant Data from BindingDB
Found 6 hits for monomerid = 580663
TargetHistone acetyltransferase KAT6A [507-778](Homo sapiens)
Pfizer
US Patent
LigandPNGBDBM580663(US11492346, Example 3)
Affinity DataKi:  1.54nM. Assay description: A. Compound preparation 1. Prepare 10 mM stock solutions in 100% DMSO from solid material 2. Serial dilute 10 mM, 1 mM or 0.1 mM compou...
Ligand InfoPC cidPC sid
In DepthDetails US Patent
TargetHistone acetyltransferase KAT6A [507-778](Homo sapiens)
Pfizer
US Patent
LigandPNGBDBM580663(US11492346, Example 3)
Affinity DataKi:  3.79nM. Assay description: A. Compound preparation 1. Prepare 10 mM stock solutions in 100% DMSO from solid material 2. Serial dilute 10 mM, 1 mM or 0.1 mM compou...
Ligand InfoPC cidPC sid
In DepthDetails US Patent
TargetHistone acetyltransferase KAT6B(Homo sapiens)
Pfizer
US Patent
LigandPNGBDBM580663(US11492346, Example 3)
Affinity DataKi:  8.63nM. Assay description: A. Compound preparation 1. Prepare 10 mM stock solutions in 100% DMSO from solid material 2. Serial dilute 10 mM, 1 mM or 0.1 mM compou...
Ligand InfoPC cidPC sid
In DepthDetails US Patent
TargetHistone acetyltransferase KAT7(Homo sapiens)
Pfizer
US Patent
LigandPNGBDBM580663(US11492346, Example 3)
Affinity DataKi:  1.72E+3nM. Assay description: A. Compound preparation 1. Prepare 10 mM stock solutions in 100% DMSO from solid material 2. Serial dilute 10 mM, 1 mM or 0.1 mM compou...
Ligand InfoPC cidPC sid
In DepthDetails US Patent
TargetHistone acetyltransferase KAT5(Homo sapiens (Human))
Pfizer
US Patent
LigandPNGBDBM580663(US11492346, Example 3)
Affinity DataKi:  9.79E+3nM. Assay description: A. Compound preparation 1. Prepare 10 mM stock solutions in 100% DMSO from solid material 2. Serial dilute 10 mM, 1 mM or 0.1 mM compou...
Ligand InfoPC cidPC sid
In DepthDetails US Patent
TargetHistone acetyltransferase KAT8(Homo sapiens (Human))
Pfizer
US Patent
LigandPNGBDBM580663(US11492346, Example 3)
Affinity DataKi:  1.74E+4nM. Assay description: TBDA. Compound preparation 1. Prepare 10 mM stock solutions in 100% DMSO from solid material 2. Serial dilute 10 mM, 1 mM or 0.1 mM com...
Ligand InfoPC cidPC sid
In DepthDetails US Patent