BDBM580725 US11492346, Example 65
SMILES COc1cc(Cn2cccn2)cc2onc(NS(=O)(=O)c3ccc(C)cc3F)c12
InChI Key InChIKey=ZUOXFQVSVXRPTL-UHFFFAOYSA-N
Data  6 KI
  Tab Delimited (TSV)   2D SDfile   Computed 3D by Vconf -m prep SDfile
Find this compound or compounds like it in BindingDB:
Activity Spreadsheet -- Enzyme Inhibition Constant Data from BindingDB
Found 6 hits for monomerid = 580725
TargetHistone acetyltransferase KAT6A [507-778](Homo sapiens)
Pfizer
US Patent
LigandPNGBDBM580725(US11492346, Example 65)
Affinity DataKi:  4.44nM. Assay description: A. Compound preparation 1. Prepare 10 mM stock solutions in 100% DMSO from solid material 2. Serial dilute 10 mM, 1 mM or 0.1 mM compou...
Ligand InfoPC cidPC sid
In DepthDetails US Patent
TargetHistone acetyltransferase KAT6A [507-778](Homo sapiens)
Pfizer
US Patent
LigandPNGBDBM580725(US11492346, Example 65)
Affinity DataKi:  6.04nM. Assay description: A. Compound preparation 1. Prepare 10 mM stock solutions in 100% DMSO from solid material 2. Serial dilute 10 mM, 1 mM or 0.1 mM compou...
Ligand InfoPC cidPC sid
In DepthDetails US Patent
TargetHistone acetyltransferase KAT6B(Homo sapiens)
Pfizer
US Patent
LigandPNGBDBM580725(US11492346, Example 65)
Affinity DataKi:  12.1nM. Assay description: A. Compound preparation 1. Prepare 10 mM stock solutions in 100% DMSO from solid material 2. Serial dilute 10 mM, 1 mM or 0.1 mM compou...
Ligand InfoPC cidPC sid
In DepthDetails US Patent
TargetHistone acetyltransferase KAT7(Homo sapiens)
Pfizer
US Patent
LigandPNGBDBM580725(US11492346, Example 65)
Affinity DataKi:  220nM. Assay description: A. Compound preparation 1. Prepare 10 mM stock solutions in 100% DMSO from solid material 2. Serial dilute 10 mM, 1 mM or 0.1 mM compou...
Ligand InfoPC cidPC sid
In DepthDetails US Patent
TargetHistone acetyltransferase KAT5(Homo sapiens (Human))
Pfizer
US Patent
LigandPNGBDBM580725(US11492346, Example 65)
Affinity DataKi:  3.06E+3nM. Assay description: A. Compound preparation 1. Prepare 10 mM stock solutions in 100% DMSO from solid material 2. Serial dilute 10 mM, 1 mM or 0.1 mM compou...
Ligand InfoPC cidPC sid
In DepthDetails US Patent
TargetHistone acetyltransferase KAT8(Homo sapiens (Human))
Pfizer
US Patent
LigandPNGBDBM580725(US11492346, Example 65)
Affinity DataKi:  1.25E+4nM. Assay description: TBDA. Compound preparation 1. Prepare 10 mM stock solutions in 100% DMSO from solid material 2. Serial dilute 10 mM, 1 mM or 0.1 mM com...
Ligand InfoPC cidPC sid
In DepthDetails US Patent