BDBM580755 US11492346, Example 97
SMILES COc1ccc(cc1S(=O)(=O)Nc1noc2cc(Cn3cccn3)cc(OC)c12)C1CC1
InChI Key InChIKey=QTLIFDPGFZBESP-UHFFFAOYSA-N
Data  5 KI
  Tab Delimited (TSV)   2D SDfile   Computed 3D by Vconf -m prep SDfile
Find this compound or compounds like it in BindingDB:
Activity Spreadsheet -- Enzyme Inhibition Constant Data from BindingDB
Found 5 hits for monomerid = 580755
TargetHistone acetyltransferase KAT6A [507-778](Homo sapiens)
Pfizer
US Patent
LigandPNGBDBM580755(US11492346, Example 97)
Affinity DataKi:  1.10nM. Assay description: A. Compound preparation 1. Prepare 10 mM stock solutions in 100% DMSO from solid material 2. Serial dilute 10 mM, 1 mM or 0.1 mM compou...
Ligand InfoPC cidPC sid
In DepthDetails US Patent
TargetHistone acetyltransferase KAT6B(Homo sapiens)
Pfizer
US Patent
LigandPNGBDBM580755(US11492346, Example 97)
Affinity DataKi:  2.74nM. Assay description: A. Compound preparation 1. Prepare 10 mM stock solutions in 100% DMSO from solid material 2. Serial dilute 10 mM, 1 mM or 0.1 mM compou...
Ligand InfoPC cidPC sid
In DepthDetails US Patent
TargetHistone acetyltransferase KAT7(Homo sapiens)
Pfizer
US Patent
LigandPNGBDBM580755(US11492346, Example 97)
Affinity DataKi:  120nM. Assay description: A. Compound preparation 1. Prepare 10 mM stock solutions in 100% DMSO from solid material 2. Serial dilute 10 mM, 1 mM or 0.1 mM compou...
Ligand InfoPC cidPC sid
In DepthDetails US Patent
TargetHistone acetyltransferase KAT5(Homo sapiens (Human))
Pfizer
US Patent
LigandPNGBDBM580755(US11492346, Example 97)
Affinity DataKi:  1.03E+3nM. Assay description: A. Compound preparation 1. Prepare 10 mM stock solutions in 100% DMSO from solid material 2. Serial dilute 10 mM, 1 mM or 0.1 mM compou...
Ligand InfoPC cidPC sid
In DepthDetails US Patent
TargetHistone acetyltransferase KAT8(Homo sapiens (Human))
Pfizer
US Patent
LigandPNGBDBM580755(US11492346, Example 97)
Affinity DataKi:  1.51E+3nM. Assay description: TBDA. Compound preparation 1. Prepare 10 mM stock solutions in 100% DMSO from solid material 2. Serial dilute 10 mM, 1 mM or 0.1 mM com...
Ligand InfoPC cidPC sid
In DepthDetails US Patent