BDBM581033 US11492374, ID 3
SMILES Oc1ccc2C[C@@H]3N(CC4CC4)CC[C@@]45[C@@H](Oc1c24)c1[nH]c2ccccc2c1C[C@@]35O
InChI Key InChIKey=WIYUZYBFCWCCQJ-PCWWUVHHSA-N
Data  1 IC50
  Tab Delimited (TSV)   2D SDfile   Computed 3D by Vconf -m prep SDfile
Find this compound or compounds like it in BindingDB:
Activity Spreadsheet -- Enzyme Inhibition Constant Data from BindingDB
Found 1 hit for monomerid = 581033
TargetDelta-type opioid receptor(Homo sapiens (Human))
Humanwell Pharmaceutical Us
US Patent
LigandPNGBDBM581033(US11492374, ID 3)
Affinity DataIC50:  0.158nM. Assay description: The measurement of opioid receptor binding affinity was conducted using a radioligand binding assay on the membranes prepared from HEK293 cells (huma...
Ligand InfoPC cidPC sid
In DepthDetails US Patent