BDBM581595 (2s,4s)-2-[2-(2,3-Dimethylphenyl)-7-azaspiro[3.5]nonane-7-carbonyl)-7-oxa-5- azaspiro[3.4]octan-6-one::US11505546, Example 10
SMILES Cc1cccc(C2CC3(C2)CCN(CC3)C(=O)[C@H]2C[C@@]3(C2)COC(=O)N3)c1C
InChI Key InChIKey=SZPWSHSCXSJFAG-QRTMHTFLSA-N
Data  1 IC50
  Tab Delimited (TSV)   2D SDfile   Computed 3D by Vconf -m prep SDfile
Find this compound or compounds like it in BindingDB:
Activity Spreadsheet -- Enzyme Inhibition Constant Data from BindingDB
Found 1 hit for monomerid = 581595
TargetMonoglyceride lipase(Homo sapiens (Human))
Janssen Pharmaceutica
US Patent
LigandPNGBDBM581595((2s,4s)-2-[2-(2,3-Dimethylphenyl)-7-azaspiro[3.5]n...)
Affinity DataIC50:  0.110nM. Assay description: The assay used to measure the in vitro activity of MGL is adapted from the assay used for another serine hydrolase (FAAH) described in Wilson et al.,...
Ligand InfoPC cidPC sid
In DepthDetails US Patent