BDBM581620 (2s,4s)-2-(2-(2-(tert-Butyl)pyrimidin-4-yl)-7-azaspiro[3.5]nonane-7-carbonyl)-7- oxa-5-azaspiro[3.4]octan-6-one::US11505546, Example 35
SMILES CC(C)(C)c1nccc(n1)C1CC2(C1)CCN(CC2)C(=O)[C@H]1C[C@@]2(C1)COC(=O)N2
InChI Key InChIKey=HHHLCAKNXIBCAE-PAVFIEEWSA-N
Data  1 IC50
  Tab Delimited (TSV)   2D SDfile   Computed 3D by Vconf -m prep SDfile
Find this compound or compounds like it in BindingDB:
Activity Spreadsheet -- Enzyme Inhibition Constant Data from BindingDB
Found 1 hit for monomerid = 581620
TargetMonoglyceride lipase(Homo sapiens (Human))
Janssen Pharmaceutica
US Patent
LigandPNGBDBM581620((2s,4s)-2-(2-(2-(tert-Butyl)pyrimidin-4-yl)-7-azas...)
Affinity DataIC50:  0.350nM. Assay description: The assay used to measure the in vitro activity of MGL is adapted from the assay used for another serine hydrolase (FAAH) described in Wilson et al.,...
Ligand InfoPC cidPC sid
In DepthDetails US Patent