BDBM582527 US11524942, Compound M7
SMILES CCCCc1nc(cn1-c1ccc(Oc2ccc(Cl)cc2)cc1)-c1ccc(OCCCO)cc1
InChI Key InChIKey=XLSMUUVTLJUXGV-UHFFFAOYSA-N
Data  1 Kd
  Tab Delimited (TSV)   2D SDfile   Computed 3D by Vconf -m prep SDfile
Find this compound or compounds like it in BindingDB:
Activity Spreadsheet -- Enzyme Inhibition Constant Data from BindingDB
Found 1 hit for monomerid = 582527
TargetAdvanced glycosylation end product-specific receptor(Homo sapiens (Human))
Vtv Therapeutics
US Patent
LigandPNGBDBM582527(US11524942, Compound M7)
Affinity DataKd:  99.8nM. Assay description: The binding affinity of COMPOUND I and compounds of the invention to human sRAGE (the soluble extracellular domain of the human receptor for advanced...
Ligand InfoPC cidPC sid
In DepthDetails US Patent