BDBM587561 US11534443, Example 60
SMILES COc1ncc(cc1NS(=O)(=O)c1ccc(F)cc1F)-c1cc(OCC2CCCO2)c2ncnc(C)c2c1
InChI Key InChIKey=HVODEZYWIAVGKQ-UHFFFAOYSA-N
Data  1 IC50
  Tab Delimited (TSV)   2D SDfile   Computed 3D by Vconf -m prep SDfile
Find this compound or compounds like it in BindingDB:
Activity Spreadsheet -- Enzyme Inhibition Constant Data from BindingDB
Found 1 hit for monomerid = 587561
TargetPhosphatidylinositol 4-phosphate 3-kinase C2 domain-containing subunit alpha(Homo sapiens (Human))
Institute of Materia Medica, Chinese Academy of Medical Sciences
US Patent
LigandPNGBDBM587561(US11534443, Example 60)
Affinity DataIC50:  1.30nM. Assay description: The Kinase-Glo™ Kinase Assay Kit was purchased from Promega. All assays were performed at room temperature using white OptiPlate™-384 well plate. The...
Ligand Info
In DepthDetails US Patent