BDBM588260 1-N-[4-[6-(3,5-dimethyl-1,2- oxazol-4-yl)-7- methoxyquinolin- 4-yl]oxyphenyl]-1-N'-(4- fluorophenyl)cyclopropane- 1,1-dicarboxamide::US11542259, Compound 184
SMILES COc1cc2nccc(Oc3ccc(NC(=O)C4(CC4)C(=O)Nc4ccc(F)cc4)cc3)c2cc1-c1c(C)noc1C
InChI Key InChIKey=JMXLDWRDBOMQJR-UHFFFAOYSA-N
Data  3 IC50
  Tab Delimited (TSV)   2D SDfile   Computed 3D by Vconf -m prep SDfile
Find this compound or compounds like it in BindingDB:
Activity Spreadsheet -- Enzyme Inhibition Constant Data from BindingDB
Found 3 hits for monomerid = 588260
TargetTyrosine-protein kinase receptor UFO [473-894,Q764R](Homo sapiens (Human))
Exelixis
US Patent
LigandPNGBDBM588260(1-N-[4-[6-(3,5-dimethyl-1,2- oxazol-4-yl)-7- metho...)
Affinity DataIC50:  55nM. Assay description: Human Axl (residues H473-A894 with Q764R, 161 nM) was incubated with 8 mM MOPS pH 7.0, 0.2 mM EDTA, 250 μM KKSRGDYMTMQIG (SEO ID NO. 43) 10 mM m...
Ligand Info
In DepthDetails US Patent
LigandPNGBDBM588260(1-N-[4-[6-(3,5-dimethyl-1,2- oxazol-4-yl)-7- metho...)
Affinity DataIC50:  55nM. Assay description: Human Met (residues R974-S1390 with A1209G and V1290L, 3.4 nM) was incubated with 8 mM MOPS pH 7.0, 0.2 mM EDTA, 250 μM KKKGQEEEYVFIE (SEO ID NO...
Ligand Info
In DepthDetails US Patent
TargetTyrosine-protein kinase Mer [557-882,H628Q,R794A](Tyrosine-protein kinase Mer)
Exelixis
US Patent
LigandPNGBDBM588260(1-N-[4-[6-(3,5-dimethyl-1,2- oxazol-4-yl)-7- metho...)
Affinity DataIC50: <10nM. Assay description: Human Mer (residues R557-E882 with H628Q and R794A, 0.7 nM) was incubated with 8 mM MOPS pH 7.0, 0.2 mM EDTA, 30 mM NaCl, 250 μM GGMEDIYFEFMGGKK...
Ligand Info
In DepthDetails US Patent