BDBM589752 US11559537, Compound 5291-(8J)
SMILES CC[C@@H](C)C(N)C(=O)N1Cc2ccc(F)cc2C1
InChI Key InChIKey=MMZVCOZOFNZWBM-CGCSKFHYSA-N
Data  7 IC50
  Tab Delimited (TSV)   2D SDfile   Computed 3D by Vconf -m prep SDfile
Find this compound or compounds like it in BindingDB:
Activity Spreadsheet -- Enzyme Inhibition Constant Data from BindingDB
Found 7 hits for monomerid = 589752
TargetDipeptidyl peptidase 8(Homo sapiens (Human))
Trustees of Tufts College
US Patent
LigandPNGBDBM589752(US11559537, Compound 5291-(8J))
Affinity DataIC50:  5.10nM. Assay description: This assay is described in Bachovchin et al. Nature Chemical Biology 10, 656-663 (2014). Briefly, purified enzymes are coupled to Luminex microsphere...
Ligand InfoPC cidPC sid
In DepthDetails US Patent
TargetDipeptidyl peptidase 9(Homo sapiens (Human))
Trustees of Tufts College
US Patent
LigandPNGBDBM589752(US11559537, Compound 5291-(8J))
Affinity DataIC50:  4.70nM. Assay description: This assay is described in Bachovchin et al. Nature Chemical Biology 10, 656-663 (2014). Briefly, purified enzymes are coupled to Luminex microsphere...
Ligand InfoPC cidPC sid
In DepthDetails US Patent
TargetDipeptidyl peptidase 4(Homo sapiens (Human))
Trustees of Tufts College
US Patent
LigandPNGBDBM589752(US11559537, Compound 5291-(8J))
Affinity DataIC50:  7.90E+3nM. Assay description: This assay is described in Bachovchin et al. Nature Chemical Biology 10, 656-663 (2014). Briefly, purified enzymes are coupled to Luminex microsphere...
Ligand InfoPC cidPC sid
In DepthDetails US Patent
TargetDipeptidyl peptidase 8/9(Homo sapiens (Human))
Trustees of Tufts College
US Patent
LigandPNGBDBM589752(US11559537, Compound 5291-(8J))
Affinity DataIC50:  58nM. Assay description: This assay is described in Bachovchin et al. Nature Chemical Biology 10, 656-663 (2014). Briefly, purified enzymes are coupled to Luminex microsphere...
Ligand InfoPC cidPC sid
In DepthDetails US Patent
TargetProlyl endopeptidase FAP(Homo sapiens (Human))
Trustees of Tufts College
US Patent
LigandPNGBDBM589752(US11559537, Compound 5291-(8J))
Affinity DataIC50: >1.00E+5nM. Assay description: This assay is described in Bachovchin et al. Nature Chemical Biology 10, 656-663 (2014). Briefly, purified enzymes are coupled to Luminex microsphere...
Ligand InfoPC cidPC sid
In DepthDetails US Patent
TargetProlyl endopeptidase(Homo sapiens (Human))
Trustees of Tufts College
US Patent
LigandPNGBDBM589752(US11559537, Compound 5291-(8J))
Affinity DataIC50: >1.00E+5nM. Assay description: This assay is described in Bachovchin et al. Nature Chemical Biology 10, 656-663 (2014). Briefly, purified enzymes are coupled to Luminex microsphere...
Ligand InfoPC cidPC sid
In DepthDetails US Patent
TargetDipeptidyl peptidase 2(Homo sapiens (Human))
Trustees of Tufts College
US Patent
LigandPNGBDBM589752(US11559537, Compound 5291-(8J))
Affinity DataIC50:  3.00E+4nM. Assay description: This assay is described in Bachovchin et al. Nature Chemical Biology 10, 656-663 (2014). Briefly, purified enzymes are coupled to Luminex microsphere...
Ligand InfoPC cidPC sid
In DepthDetails US Patent