BDBM594222 US11584747, Example 16::US11584747, Example 17::US11584747, Example 190::US11584747, Example 191
SMILES CC[C@@H]1CN([C@@H](CC)CN1C(C)c1ccc(OC)cc1)c1nc(=O)n(C)c2ccc(nc12)C#N
InChI Key InChIKey=DPYDLOFGCCRCLA-SJRAPUSDSA-N
Data  8 IC50
  Tab Delimited (TSV)   2D SDfile   Computed 3D by Vconf -m prep SDfile
Find this compound or compounds like it in BindingDB:
Activity Spreadsheet -- Enzyme Inhibition Constant Data from BindingDB
Found 8 hits for monomerid = 594222
TargetDiacylglycerol kinase alpha(Homo sapiens)
Bristol-Myers Squibb
US Patent
LigandPNGBDBM594222(US11584747, Example 16 | US11584747, Example 17 | ...)
Affinity DataIC50:  45nM. Assay description: The reactions were carried out in 50 mM MOPS pH 7.5, 100 mM NaCl, 10 mM MgCl2, 1 μM CaCl2, and 1 mM DTT (assay buffer). The reactions using a de...
Ligand InfoPC cidPC sid
In DepthDetails US Patent
TargetDiacylglycerol kinase zeta(Homo sapiens)
Bristol-Myers Squibb
US Patent
LigandPNGBDBM594222(US11584747, Example 16 | US11584747, Example 17 | ...)
Affinity DataIC50:  37nM. Assay description: The reactions were carried out in 50 mM MOPS pH 7.5, 100 mM NaCl, 10 mM MgCl2, 1 μM CaCl2, and 1 mM DTT (assay buffer). The reactions using a de...
Ligand InfoPC cidPC sid
In DepthDetails US Patent
TargetDiacylglycerol kinase alpha(Homo sapiens)
Bristol-Myers Squibb
US Patent
LigandPNGBDBM594222(US11584747, Example 16 | US11584747, Example 17 | ...)
Affinity DataIC50:  320nM. Assay description: The reactions were carried out in 50 mM MOPS pH 7.5, 100 mM NaCl, 10 mM MgCl2, 1 μM CaCl2, and 1 mM DTT (assay buffer). The reactions using a de...
Ligand InfoPC cidPC sid
In DepthDetails US Patent
TargetDiacylglycerol kinase zeta(Homo sapiens)
Bristol-Myers Squibb
US Patent
LigandPNGBDBM594222(US11584747, Example 16 | US11584747, Example 17 | ...)
Affinity DataIC50:  260nM. Assay description: The reactions were carried out in 50 mM MOPS pH 7.5, 100 mM NaCl, 10 mM MgCl2, 1 μM CaCl2, and 1 mM DTT (assay buffer). The reactions using a de...
Ligand InfoPC cidPC sid
In DepthDetails US Patent
TargetDiacylglycerol kinase alpha(Homo sapiens)
Bristol-Myers Squibb
US Patent
LigandPNGBDBM594222(US11584747, Example 16 | US11584747, Example 17 | ...)
Affinity DataIC50:  29nM. Assay description: The reactions were carried out in 50 mM MOPS pH 7.5, 100 mM NaCl, 10 mM MgCl2, 1 μM CaCl2, and 1 mM DTT (assay buffer). The reactions using a de...
Ligand InfoPC cidPC sid
In DepthDetails US Patent
TargetDiacylglycerol kinase zeta(Homo sapiens)
Bristol-Myers Squibb
US Patent
LigandPNGBDBM594222(US11584747, Example 16 | US11584747, Example 17 | ...)
Affinity DataIC50:  17nM. Assay description: The reactions were carried out in 50 mM MOPS pH 7.5, 100 mM NaCl, 10 mM MgCl2, 1 μM CaCl2, and 1 mM DTT (assay buffer). The reactions using a de...
Ligand InfoPC cidPC sid
In DepthDetails US Patent
TargetDiacylglycerol kinase alpha [9-727](Homo sapiens)
Bristol-Myers Squibb
US Patent
LigandPNGBDBM594222(US11584747, Example 16 | US11584747, Example 17 | ...)
Affinity DataIC50:  460nM. Assay description: The reactions were carried out in 50 mM MOPS pH 7.5, 100 mM NaCl, 10 mM MgCl2, 1 μM CaCl2, and 1 mM DTT (assay buffer). The reactions using a de...
Ligand InfoPC cidPC sid
In DepthDetails US Patent
TargetDiacylglycerol kinase zeta(Homo sapiens)
Bristol-Myers Squibb
US Patent
LigandPNGBDBM594222(US11584747, Example 16 | US11584747, Example 17 | ...)
Affinity DataIC50:  2.14E+3nM. Assay description: The reactions were carried out in 50 mM MOPS pH 7.5, 100 mM NaCl, 10 mM MgCl2, 1 μM CaCl2, and 1 mM DTT (assay buffer). The reactions using a de...
Ligand InfoPC cidPC sid
In DepthDetails US Patent