BDBM594236 US11584747, Example 30::US11584747, Example 31
SMILES CC[C@@H]1CN([C@@H](CC)CN1C(C)c1ccc(OC(F)(F)F)c(F)c1)c1nc(=O)n(C)c2ccc(nc12)C#N
InChI Key InChIKey=RCWNOSYNMDISPZ-FWZRCDJUSA-N
Data  4 IC50
  Tab Delimited (TSV)   2D SDfile   Computed 3D by Vconf -m prep SDfile
Find this compound or compounds like it in BindingDB:
Activity Spreadsheet -- Enzyme Inhibition Constant Data from BindingDB
Found 4 hits for monomerid = 594236
TargetDiacylglycerol kinase alpha(Homo sapiens)
Bristol-Myers Squibb
US Patent
LigandPNGBDBM594236(US11584747, Example 30 | US11584747, Example 31)
Affinity DataIC50:  76nM. Assay description: The reactions were carried out in 50 mM MOPS pH 7.5, 100 mM NaCl, 10 mM MgCl2, 1 μM CaCl2, and 1 mM DTT (assay buffer). The reactions using a de...
Ligand InfoPC cidPC sid
In DepthDetails US Patent
TargetDiacylglycerol kinase zeta(Homo sapiens)
Bristol-Myers Squibb
US Patent
LigandPNGBDBM594236(US11584747, Example 30 | US11584747, Example 31)
Affinity DataIC50:  960nM. Assay description: The reactions were carried out in 50 mM MOPS pH 7.5, 100 mM NaCl, 10 mM MgCl2, 1 μM CaCl2, and 1 mM DTT (assay buffer). The reactions using a de...
Ligand InfoPC cidPC sid
In DepthDetails US Patent
TargetDiacylglycerol kinase alpha(Homo sapiens)
Bristol-Myers Squibb
US Patent
LigandPNGBDBM594236(US11584747, Example 30 | US11584747, Example 31)
Affinity DataIC50:  1.70E+3nM. Assay description: The reactions were carried out in 50 mM MOPS pH 7.5, 100 mM NaCl, 10 mM MgCl2, 1 μM CaCl2, and 1 mM DTT (assay buffer). The reactions using a de...
Ligand InfoPC cidPC sid
In DepthDetails US Patent
TargetDiacylglycerol kinase zeta(Homo sapiens)
Bristol-Myers Squibb
US Patent
LigandPNGBDBM594236(US11584747, Example 30 | US11584747, Example 31)
Affinity DataIC50:  4nM. Assay description: The reactions were carried out in 50 mM MOPS pH 7.5, 100 mM NaCl, 10 mM MgCl2, 1 μM CaCl2, and 1 mM DTT (assay buffer). The reactions using a de...
Ligand InfoPC cidPC sid
In DepthDetails US Patent