BDBM601944 4-((6',8'-dimethyl-7'-oxo-7',8'- dihydro-6'H-spiro[cyclohexane-1,9'- pyrrolo[1,5-a:2,3-d']dipyrimidin]-2'- yl)amino)benzenesulfonamide::US11643416, Compound 43
SMILES CC1C(=O)N(C)c2cc3cnc(Nc4ccc(cc4)S(N)(=O)=O)nc3n2C11CCCCC1
InChI Key InChIKey=FLIVKVQMXOAQAK-UHFFFAOYSA-N
Data  9 IC50
  Tab Delimited (TSV)   2D SDfile   Computed 3D by Vconf -m prep SDfile
Find this compound or compounds like it in BindingDB:
Activity Spreadsheet -- Enzyme Inhibition Constant Data from BindingDB
Found 9 hits for monomerid = 601944
TargetCyclin-A2/Cyclin-dependent kinase 2(Homo sapiens (Human))
G1 Therapeutics
US Patent
LigandPNGBDBM601944(4-((6',8'-dimethyl-7'-oxo-7',8'- dihydro-6'H-spiro...)
Affinity DataIC50:  4nM. Assay description: Selected compounds disclosed herein were tested in kinase assays by Nanosyn (Santa Clara, Calif.) to determine their inhibitory effect on these CDKs....
Ligand InfoPC cidPC sid
In DepthDetails US Patent
TargetCyclin-dependent kinase 2/G1/S-specific cyclin-E1(Homo sapiens (Human))
G1 Therapeutics
US Patent
LigandPNGBDBM601944(4-((6',8'-dimethyl-7'-oxo-7',8'- dihydro-6'H-spiro...)
Affinity DataIC50:  4nM. Assay description: Selected compounds disclosed herein were tested in kinase assays by Nanosyn (Santa Clara, Calif.) to determine their inhibitory effect on these CDKs....
Ligand InfoPC cidPC sid
In DepthDetails US Patent
TargetCyclin-dependent kinase 4/G1/S-specific cyclin-D1(Homo sapiens (Human))
G1 Therapeutics
US Patent
LigandPNGBDBM601944(4-((6',8'-dimethyl-7'-oxo-7',8'- dihydro-6'H-spiro...)
Affinity DataIC50:  69nM. Assay description: Selected compounds disclosed herein were tested in kinase assays by Nanosyn (Santa Clara, Calif.) to determine their inhibitory effect on these CDKs....
Ligand InfoPC cidPC sid
In DepthDetails US Patent
TargetCyclin-dependent kinase 6/G1/S-specific cyclin-D3(Homo sapiens (Human))
G1 Therapeutics
US Patent
LigandPNGBDBM601944(4-((6',8'-dimethyl-7'-oxo-7',8'- dihydro-6'H-spiro...)
Affinity DataIC50:  186nM. Assay description: Selected compounds disclosed herein were tested in kinase assays by Nanosyn (Santa Clara, Calif.) to determine their inhibitory effect on these CDKs....
Ligand InfoPC cidPC sid
In DepthDetails US Patent
TargetCyclin-dependent kinase 7(Homo sapiens (Human))
G1 Therapeutics
US Patent
LigandPNGBDBM601944(4-((6',8'-dimethyl-7'-oxo-7',8'- dihydro-6'H-spiro...)
Affinity DataIC50:  250nM. Assay description: Selected compounds disclosed herein were tested in kinase assays by Nanosyn (Santa Clara, Calif.) to determine their inhibitory effect on these CDKs....
Ligand InfoPC cidPC sid
In DepthDetails US Patent
TargetCyclin-dependent kinase 1(Homo sapiens (Human))
G1 Therapeutics
US Patent
LigandPNGBDBM601944(4-((6',8'-dimethyl-7'-oxo-7',8'- dihydro-6'H-spiro...)
Affinity DataIC50:  33nM. Assay description: Selected compounds disclosed herein were tested in kinase assays by Nanosyn (Santa Clara, Calif.) to determine their inhibitory effect on these CDKs....
Ligand InfoPC cidPC sid
In DepthDetails US Patent
TargetCyclin-dependent kinase 3/G1/S-specific cyclin-E1(Homo sapiens (Human))
G1 Therapeutics
US Patent
LigandPNGBDBM601944(4-((6',8'-dimethyl-7'-oxo-7',8'- dihydro-6'H-spiro...)
Affinity DataIC50:  29nM. Assay description: Selected compounds disclosed herein were tested in kinase assays by Nanosyn (Santa Clara, Calif.) to determine their inhibitory effect on these CDKs....
Ligand InfoPC cidPC sid
In DepthDetails US Patent
TargetCyclin-dependent kinase 5 activator 1(Homo sapiens (Human))
G1 Therapeutics
US Patent
LigandPNGBDBM601944(4-((6',8'-dimethyl-7'-oxo-7',8'- dihydro-6'H-spiro...)
Affinity DataIC50:  15nM. Assay description: Selected compounds disclosed herein were tested in kinase assays by Nanosyn (Santa Clara, Calif.) to determine their inhibitory effect on these CDKs....
Ligand InfoPC cidPC sid
In DepthDetails US Patent
TargetCyclin-T1/Cyclin-dependent kinase 9(Homo sapiens (Human))
G1 Therapeutics
US Patent
LigandPNGBDBM601944(4-((6',8'-dimethyl-7'-oxo-7',8'- dihydro-6'H-spiro...)
Affinity DataIC50:  21nM. Assay description: Selected compounds disclosed herein were tested in kinase assays by Nanosyn (Santa Clara, Calif.) to determine their inhibitory effect on these CDKs....
Ligand InfoPC cidPC sid
In DepthDetails US Patent