BDBM601958 N-methyl-4-((3'-oxo-2',3'-dihydro- 1'H-spiro[cyclohexane-1,4'- pyrimido[5',4':4,5]pyrrolo[2,1- c][1,2,4]triazin]-7'- yl)amino)benzamide::US11643416, Compound 64
SMILES CNC(=O)c1ccc(Nc2ncc3cc4NNC(=O)C5(CCCCC5)n4c3n2)cc1
InChI Key InChIKey=NUBBIJVOSXWZTF-UHFFFAOYSA-N
Data  9 IC50
  Tab Delimited (TSV)   2D SDfile   Computed 3D by Vconf -m prep SDfile
Find this compound or compounds like it in BindingDB:
Activity Spreadsheet -- Enzyme Inhibition Constant Data from BindingDB
Found 9 hits for monomerid = 601958
TargetCyclin-A2/Cyclin-dependent kinase 2(Homo sapiens (Human))
G1 Therapeutics
US Patent
LigandPNGBDBM601958(N-methyl-4-((3'-oxo-2',3'-dihydro- 1'H-spiro[cyclo...)
Affinity DataIC50:  85nM. Assay description: Selected compounds disclosed herein were tested in kinase assays by Nanosyn (Santa Clara, Calif.) to determine their inhibitory effect on these CDKs....
Ligand InfoPC cidPC sid
In DepthDetails US Patent
TargetCyclin-dependent kinase 2/G1/S-specific cyclin-E1(Homo sapiens (Human))
G1 Therapeutics
US Patent
LigandPNGBDBM601958(N-methyl-4-((3'-oxo-2',3'-dihydro- 1'H-spiro[cyclo...)
Affinity DataIC50:  23nM. Assay description: Selected compounds disclosed herein were tested in kinase assays by Nanosyn (Santa Clara, Calif.) to determine their inhibitory effect on these CDKs....
Ligand InfoPC cidPC sid
In DepthDetails US Patent
TargetCyclin-dependent kinase 4/G1/S-specific cyclin-D1(Homo sapiens (Human))
G1 Therapeutics
US Patent
LigandPNGBDBM601958(N-methyl-4-((3'-oxo-2',3'-dihydro- 1'H-spiro[cyclo...)
Affinity DataIC50:  132nM. Assay description: Selected compounds disclosed herein were tested in kinase assays by Nanosyn (Santa Clara, Calif.) to determine their inhibitory effect on these CDKs....
Ligand InfoPC cidPC sid
In DepthDetails US Patent
TargetCyclin-dependent kinase 6/G1/S-specific cyclin-D3(Homo sapiens (Human))
G1 Therapeutics
US Patent
LigandPNGBDBM601958(N-methyl-4-((3'-oxo-2',3'-dihydro- 1'H-spiro[cyclo...)
Affinity DataIC50:  417nM. Assay description: Selected compounds disclosed herein were tested in kinase assays by Nanosyn (Santa Clara, Calif.) to determine their inhibitory effect on these CDKs....
Ligand InfoPC cidPC sid
In DepthDetails US Patent
TargetCyclin-dependent kinase 7(Homo sapiens (Human))
G1 Therapeutics
US Patent
LigandPNGBDBM601958(N-methyl-4-((3'-oxo-2',3'-dihydro- 1'H-spiro[cyclo...)
Affinity DataIC50: >1.00E+3nM. Assay description: Selected compounds disclosed herein were tested in kinase assays by Nanosyn (Santa Clara, Calif.) to determine their inhibitory effect on these CDKs....
Ligand InfoPC cidPC sid
In DepthDetails US Patent
TargetCyclin-dependent kinase 1(Homo sapiens (Human))
G1 Therapeutics
US Patent
LigandPNGBDBM601958(N-methyl-4-((3'-oxo-2',3'-dihydro- 1'H-spiro[cyclo...)
Affinity DataIC50:  505nM. Assay description: Selected compounds disclosed herein were tested in kinase assays by Nanosyn (Santa Clara, Calif.) to determine their inhibitory effect on these CDKs....
Ligand InfoPC cidPC sid
In DepthDetails US Patent
TargetCyclin-dependent kinase 3/G1/S-specific cyclin-E1(Homo sapiens (Human))
G1 Therapeutics
US Patent
LigandPNGBDBM601958(N-methyl-4-((3'-oxo-2',3'-dihydro- 1'H-spiro[cyclo...)
Affinity DataIC50:  105nM. Assay description: Selected compounds disclosed herein were tested in kinase assays by Nanosyn (Santa Clara, Calif.) to determine their inhibitory effect on these CDKs....
Ligand InfoPC cidPC sid
In DepthDetails US Patent
TargetCyclin-dependent kinase 5 activator 1(Homo sapiens (Human))
G1 Therapeutics
US Patent
LigandPNGBDBM601958(N-methyl-4-((3'-oxo-2',3'-dihydro- 1'H-spiro[cyclo...)
Affinity DataIC50:  65nM. Assay description: Selected compounds disclosed herein were tested in kinase assays by Nanosyn (Santa Clara, Calif.) to determine their inhibitory effect on these CDKs....
Ligand InfoPC cidPC sid
In DepthDetails US Patent
TargetCyclin-T1/Cyclin-dependent kinase 9(Homo sapiens (Human))
G1 Therapeutics
US Patent
LigandPNGBDBM601958(N-methyl-4-((3'-oxo-2',3'-dihydro- 1'H-spiro[cyclo...)
Affinity DataIC50:  85nM. Assay description: Selected compounds disclosed herein were tested in kinase assays by Nanosyn (Santa Clara, Calif.) to determine their inhibitory effect on these CDKs....
Ligand InfoPC cidPC sid
In DepthDetails US Patent