BDBM607141 US11685745, Example 31
SMILES CN(C)Cc1nc2cc(Cl)c3NC(=O)NC4(CCCCC4)c3c2o1
InChI Key InChIKey=KUZIOXPXTPPIHI-UHFFFAOYSA-N
Data  1 IC50
  Tab Delimited (TSV)   2D SDfile   Computed 3D by Vconf -m prep SDfile
Find this compound or compounds like it in BindingDB:
Activity Spreadsheet -- Enzyme Inhibition Constant Data from BindingDB
Found 1 hit for monomerid = 607141
TargetcAMP-specific 3',5'-cyclic phosphodiesterase 7B(Homo sapiens (Human))
Dart Neuroscience
US Patent
LigandPNGBDBM607141(US11685745, Example 31)
Affinity DataIC50:  55nM. Assay description: PDE7 inhibition was determined by an IMAP TR-FRET assay using PDE7B. The IMAP TR-FRET PDE assay was optimized for concentration of enzyme, FAM-cAMP s...
Ligand InfoPC cidPC sid
In DepthDetails US Patent