BDBM615750 US20230271954, Compound 49::cis-8-((4-(cyclopropyl(4-fluorophenyl)amino) cyclohexyl)(methyl)amino)-5-methyl-6-oxo-5,6- dihydro-1,5-naphthyridine-2-carbonitrile
SMILES CN(C1CC[C@@H](CC1)N(C1CC1)c1ccc(F)cc1)c1cc(=O)n(C)c2ccc(nc12)C#N
InChI Key InChIKey=YNJDHXVSMPJIFA-QSNACTPISA-N
Data  2 IC50
  Tab Delimited (TSV)   2D SDfile   Computed 3D by Vconf -m prep SDfile
Find this compound or compounds like it in BindingDB:
Activity Spreadsheet -- Enzyme Inhibition Constant Data from BindingDB
Found 2 hits for monomerid = 615750
TargetDiacylglycerol kinase alpha(Homo sapiens)
Gossamer Bio Services
US Patent
LigandPNGBDBM615750(US20230271954, Compound 49 | cis-8-((4-(cyclopropy...)
Affinity DataIC50:  550nM. Assay description: Compounds of the present invention were prepared into 10 mM DMSO solution and 10 nL of stock was transferred into 384 plates (Optiplate 384 plate) us...
Ligand InfoPC cidPC sid
In DepthDetails US Patent
TargetDiacylglycerol kinase zeta(Homo sapiens)
Gossamer Bio Services
US Patent
LigandPNGBDBM615750(US20230271954, Compound 49 | cis-8-((4-(cyclopropy...)
Affinity DataIC50: <10nM. Assay description: Compounds of the present invention were prepared into 10 mM DMSO solution and 10 nL of stock was transferred into 384 plates (Optiplate 384 plate) us...
Ligand InfoPC cidPC sid
In DepthDetails US Patent